{"text_format":"1","workbook":"xlsx","n_sheets":10,"sheets":["Disclaimer","Toepassingsvormen in opp.water","Toepassingsvormen","Grootschalige toepassing","In opp.water","Toepassingseis","Partijgrootte","TEQ - dioxines","Bodemkwaliteit","Start"],"not_rendered":{"charts":0,"images":2,"macros":1,"external_links":0,"defined_names":0,"comments":8,"pivot_tables":0},"unopened":[],"bounds":{"document_bytes":16777216,"sheet_cells":100000,"rows_first":2000,"rows_last":500,"rows_between":2000,"halvings":0,"cell_chars":16384,"cell_head_chars":4096},"cells_cut":0,"cells_raw":0,"read":"whole","date_system":"1900"}

{"sheet":"Disclaimer","index":0,"n_rows":7,"n_cols":1,"rows_kept":7,"cut":false,"hidden":false,"merged":[]}
["Disclaimer"]
["De rekenblad ontwerper spant zich in om fouten, storingen en onderbrekingen van technische aard zo veel mogelijk te voorkomen. De rekenblad ontwerper kan echter niet garanderen dat onderhavig rekenblad volledig vrij van onderbreking en foutloos is en niet door andere technische problemen wordt getroffen. De rekenblad ontwerper kan niet aansprakelijk worden gesteld voor rechtstreekse of onrechtstreekse schade die ontstaat uit het gebruik van onderhavig rekenblad of van de op of via dit rekenblad ter beschikking gestelde informatie, met inbegrip, zonder beperking, van alle verliezen, werkonderbrekingen, beschadiging van uw programma's of andere gegevens op het computersysteem, of van uw apparatuur of programma's. Storingen, onderbrekingen of fouten in de elektronische toelevering kunnen in geen geval aanleiding geven tot enige financiële compensatie."]
["De rekenblad ontwerper is niet verantwoordelijk voor welke beslissing of handeling dan ook die door de gebruiker zou zijn genomen op basis van de verstrekte informatie of gegevens; noch is hij verantwoordelijk voor fouten of vergissingen; hij is evenmin verantwoordelijk ten aanzien van de gebruiker of derden voor mogelijk geleden directe, indirecte, incidentele schade, winstderving, verlies van opportuniteit of voor eender welke schade veroorzaakt door haar nalatigheid of vergetelheid in het verschaffen, compileren, monteren, schrijven, interpreteren, melden en verspreiden van info of data door middel van dit rekenblad, en dit zelfs indien de rekenblad ontwerper gewaarschuwd werd voor zulke schade."]
["Hyperlinks en verwijzingen\nOp of via  dit rekenblad wordt u met (hyper)links doorverwezen naar websites van overheden, instanties of organisaties, en wordt u verwezen naar informatiebronnen die door derden worden beheerd. De rekenblad ontwerper beschikt dan ook over geen enkele technische of inhoudelijke controlemogelijkheid of zeggenschap en kan daarom geen enkele garantie bieden over de volledigheid of juistheid van de inhoud, noch over de beschikbaarheid van deze websites en informatiebronnen. De hyperlinks naar andere sites die dit blad bevat, houden geen enkele bekrachtiging in van de externe site of van de inhoud ervan. De links worden u aangeboden ter informatie en voor uw gebruiksgemak. De rekenblad ontwerper aanvaardt derhalve geen aansprakelijkheid voor rechtstreekse of onrechtstreekse schade die voortvloeit uit het raadplegen of het gebruik van dergelijke externe websites en hun inhoud."]
["Intellectuele eigendomsrechten\nU hebt het recht om de informatie op dit blad te consulteren, voor persoonlijk gebruik te downloaden en te reproduceren, mits u de bron vermeldt, overeenkomstig de bepalingen van de wet betreffende het auteursrecht en de naburige rechten. De rekenblad ontwerper behoudt alle intellectuele eigendomsrechten in dit rekenblad zelf en op de ter beschikking gestelde informatie voor zover deze niet openbaar is volgens de wet."]
["Vertrouwelijkheid\nAlle commentaar of materiaal dat u ongevraagd en uit eigen beweging aan de rekenblad ontwerper bezorgt, met inbegrip van de gegevens of reacties betreffende de inhoud van dit rekenblad, zal als niet-vertrouwelijk worden beschouwd, tenzij u uitdrukkelijk anders bepaalt. De rekenblad ontwerper wijst iedere verplichting van de hand inzake het gevolg dat aan die algemene reacties en gegevens moet worden gegeven. De rekenblad ontwerper mag die reacties en gegevens naar eigen goeddunken gebruiken, behoudens beperkingen bepaald in de wet tot bescherming van persoonsgegevens. U stemt ermee in dat de rekenblad ontwerper de ideeën, concepten, kennis en technieken, vervat in uw reacties, kan aanwenden voor welk doel ook, met inbegrip van, onder andere, de ontwikkeling en het concipiëren van nieuwe diensten."]
["Geschillen\nAlle geschillen en vorderingen die voortkomen uit het gebruik van dit rekenblad of enig gegeven dat erop staat, vallen onder de toepassing van het Nederlands recht. Gebruik van dit rekenblad houdt in dat u zich onderwerpt aan de rechtspraak van de rechtbanken van Nederland en dat u aanvaardt om alle gedingen alleen voor die rechtbanken te brengen."]

{"sheet":"Toepassingsvormen in opp.water","index":1,"n_rows":37,"n_cols":10,"rows_kept":37,"cut":false,"hidden":false,"merged":[[7,9,7,10],[15,4,15,5],[7,1,7,2],[7,4,7,5],[7,6,7,7],[9,2,9,4],[9,5,9,6],[9,7,9,9],[14,1,14,2],[14,4,14,5],[14,6,14,7],[14,9,14,10],[32,2,33,4],[32,5,32,6],[32,7,34,9],[30,1,30,2],[30,4,30,7],[30,9,30,10],[31,4,31,7],[22,4,22,5],[22,6,22,7],[22,9,22,10],[8,4,8,5],[24,2,25,4],[24,5,24,6],[24,7,24,9],[23,4,23,5],[23,6,23,7],[16,2,17,4],[16,5,16,6],[16,7,16,9],[22,1,22,2]]}
[]
[]
[null,"Zie Rbk en Nota van toelichting Rbk behorende bij  par 4.10 en 4.11"]
[]
[]
[null,"Maximale waarden voor verspreiden van baggerspecie over het aangrenzende perceel:"]
[]
[null,"vrij toepasbaar",null,null,"verspreidbaar op aangrenzend perceel",null,"niet verspreidbaar",null,null,"nooit verspreiden/toepassen"]
[null,null,null,null,"ontvangstplicht"]
[null,null,"AW2000\n+ art. 4.2.2-4/5 Rbk (N,T-toets)",null,null,"msPAF-metalen <50%\nmsPAF-organisch <20%\nmin.olie <3000\nCd <7,5\nniet met X aangegeven stoffen Rbk, bijlage B, tabel 1 < AW2000#",null,"Interventiewaarde droge bodem"]
[]
[]
[null,"Maximale waarden voor verspreiden van baggerspecie in oppervlaktewater:"]
[]
[null,"vrij toepasbaar",null,null,"verspreidbaar in zoet water",null,"niet verspreidbaar",null,null,"nooit verspreiden/toepassen"]
[null,null,null,null,"toetsing ontvangende bodem niet noodzakelijk"]
[null,null,"AW2000\n+ art. 4.2.2-4/5 Rbk (N,T-toets)",null,null,"HVN Rijn gemeten bij Lobith (P95)\nniet genormeerde stoffen Rbk, bijlage B, tabel 2 < AW2000##",null,"Interventiewaarde waterbodem"]
[]
[]
[]
[null,"Maximale waarden voor toepassen van grond in oppervlaktewater (in een werk):"]
[null,"NB: In opp.water wordt geen grond toegepast die niet afkomstig is van de bodem onder het opp.water die de maximale waarden voor de functieklasse industrie overschrijdt."]
[null,"vrij toepasbaar",null,null,"toepasbaar klasse A",null,"toepasbaar klasse B",null,null,"nooit verspreiden/toepassen"]
[]
[null,null,"AW2000\n+ art. 4.2.2-4/5 Rbk (N,T-toets)",null,null,"HVN Rijn gemeten bij Lobith (P95)\nniet genormeerde stoffen Rbk, bijlage B, tabel 2 < AW2000##",null,"Interventiewaarde waterbodem"]
[]
[]
[]
[null,"Maximale waarden voor verspreiden van baggerspecie in zout oppervlaktewater:"]
[null,"(in WVO-gebied: Zeeuwse delta, Noordzeekust en Waddenzee)"]
[null,"vrij toepasbaar",null,null,"verspreidbaar in zeewater",null,null,null,null,"nooit verspreiden/toepassen"]
[null,null,null,null,"toetsing ontvangende bodem niet noodzakelijk"]
[null,null,"AW2000\n+ art. 4.2.2-4/5 Rbk (N,T-toets)",null,null,null,null,"Maximale waarden zout opp.water (CTT)\n(CTT=chemische toxiciteits toets)\n+ art. 4.11-2/3 Rbk (N,T-toets voor niet-prioritaire stoffen)"]
[]
[]
[null,"#: Rbk, Bijlage B, tabel 1, voetnoot 2: Voor de gemeten stoffen, die geen deel uitmaken van de msPAF-berekening, worden de toetsingsregels van de Achtergrondwaarden toegepast."]
[null,"##: Rbk, Bijlage B, tabel 2, voetnoot  2: Voor stoffen waarvoor geen HVN is afgeleid gelden de Achtergrondwaarden en de toetsingsregels van de Achtergrondwaarden."]

{"sheet":"Toepassingsvormen","index":2,"n_rows":18,"n_cols":6,"rows_kept":18,"cut":false,"hidden":false,"merged":[[8,0,9,0],[2,0,2,1],[2,2,3,2],[2,3,2,5],[6,0,7,0]]}
[]
[]
["toepassing",null,"Regelgeving","toepassingsvoorwaarden"]
["toepassingsvorm","generiek / gebiedsspecifiek",null,"kwaliteit bepalen?\nNB: particulier en boer vrijgesteld","melden?","overige voorwaarden"]
[]
["toepassen < 50 m3 AW2000 grond","nvt","Bbk","ja","nee","vijf jaar bewaren gegevens"]
["toepassing op landbodem","generiek","Bbk","ja","ja","toepassing op klasseniveau"]
[null,"gebiedsspecifiek","Bbk","ja","ja","toetsing aan lokale maximale waarden"]
["toepassing op waterbodem","generiek","Bbk","ja","ja","toepassing op klasseniveau"]
[null,"gebiedsspecifiek","Bbk","ja","ja","toetsing aan lokale maximale waarden"]
["grootschalige toepassing","nvt","Bbk","ja","ja","toetsing aan emissiewaarden\n(1-emissietoetswaarden en evt. 2-maximale emissiewaarden)"]
["tijdelijke uitname","nvt","Wbb","nee\n(wel uitsluiten dat het een ernstig geval betreft)","nee","- geen beweking;\n- zelfde plaats;\n- zelfde condities"]
["hergebruik op locatie","nvt","Wbb","nee\n(wel uitsluiten dat het een ernstig geval betreft)","nee","- binnen locatie;\n- gesloten grondbalans"]
["opslag / plaatsing in depot","nvt","> 6 maanden = Wm vergunning plichtig","ja","nee","aantonen kwaliteit"]
["tijdelijke opslag","nvt","geen vergunningplicht:\n- < 6 maanden of\n- afvoer binnen 3 jaar voor landbodems en 10 jaar voor waterbodems","ja","ja","langer dan zes maanden: eindbestemming melden (Bbk art. 42.4);\nkwaliteit voldoet aan ontvangende bodem"]
["weilanddepot","generiek","Bbk","ja","nee","depot op aangrenzend perceel < 3 jaar"]
["reinigen","nvt","Wbb","ja","nee"]
["storten","nvt","Wbb","ja","nee","alleen mogelijk met niet-reinigbaarheids-verklaring Bodem+"]

{"sheet":"Grootschalige toepassing","index":3,"n_rows":55,"n_cols":31,"rows_kept":55,"cut":false,"hidden":false,"merged":[[1,2,1,5],[2,2,2,5],[41,1,41,10],[20,2,20,4]]}
[null,null,null,null,null,null,null,null,null,null,null,null,null,null,null,{"$f":"IF(AND(OR(F7=1,F13=1),F14=1),1,0)","v":1}]
["Projectcode: ",null,{"$f":"Bodemkwaliteit!H3","v":"< code >"},null,null,null,{"$f":"Bodemkwaliteit!L3","v":"Partij < partijnaam >"},null,null,null,null,null,null,null,null,null,null,null,null,null,{"$f":"Bodemkwaliteit!G21","v":1}]
["Datum toetsing:",null,{"$f":"Bodemkwaliteit!H4","v":"<datum>"}]
["Betreft het GBT op de bodem of in het opp.water?",null,null,null,null,0,"(bodem=0; opp.water=1)"]
["Betreft het een GBT onder waterniveau en is "]
["de bagger afkomstig van hetzelfde beheergebied?",null,null,null,null,0,"(ja=1; nee=0)"]
["Voldoet de partij aan de volgende eisen:",null,null,null,null,{"$f":"IF(AND(F8=1,F9=1,F10=1),1,0)","v":0}]
["inhoud van de partij gelijk of groter 5000 m3?",null,null,null,null,0]
["toepassingshoogte gelijk of groter 2m dik?",null,null,null,null,0,"(ja=1; nee=0)",null,null,null,null,null,null,null,null,null,null,null,"res. Kwal. (2 van 2) B157:     ",{"$f":"Bodemkwaliteit!G71","v":"AW2000 grond"},null,"(niet mogelijk / niet toepasbare grond / schone grond / bodemklasse)"]
["de toepassing is bestemd voor ophoging?",null,null,null,null,0,"(ja=1; nee=0)",null,null,null,null,null,null,null,null,null,null,null,"res. Kwal. (2 van 2) E157:     ",{"$f":"Bodemkwaliteit!J71","v":""},null,"(industrie<x<i-waarde / industrie/wonen / zie N,T-toets)"]
["Of  als een of meer van bovenstaande vragen met nee zijn beantwoord:"]
["wordt de partij toegevoegd aan een bestaande partij, zodanig dat de nieuwe, "]
["totale partij, voldoet aan bovenstaande eisen?",null,null,null,null,1,"(ja=1; nee=0)"]
["aandeel bodemvreemde materialen < 20%?",null,null,null,null,{"$f":"IF(Bodemkwaliteit!J14<20,1,0)","v":1},"(ja=1; nee=0)"]
["grepen:","2 maal ",null,{"$f":"Bodemkwaliteit!J15","v":50},null,null,null,null,null,null,null,null,null,null,null,null,null,null,"bg of d","BG-intral","ag","Labo-d"]
["Macroparameters"]
["zuurgraad",null,{"$f":"Bodemkwaliteit!L17","v":7},{"$f":"IF(C17=0,\" \",(Bodemkwaliteit!Y17))","v":7},null,null,null,null,null,null,null,null,null,null,null,null,null,null,null,null,"n.v.t.",null,null,null,null,null,null,null,null,null,{"$f":"A17","v":"zuurgraad"}]
["droge stof gehalte (massa-%)",null,null,{"$f":"Bodemkwaliteit!Y18","v":100},null,null,null,null,null,null,null,null,null,null,null,null,null,null,null,3.0000000000000001E-3,1E-3,null,null,null,null,null,null,null,null,null,{"$f":"A18","v":"droge stof gehalte (massa-%)"}]
["lutum gehalte in % d.s.",null,null,{"$f":"Bodemkwaliteit!Y19","v":25},{"$f":"D19","v":25},null,null,null,null,null,null,null,null,null,null,null,null,null,null,1.4999999999999999E-2,5.0000000000000001E-3,null,null,null,null,null,null,null,null,null,{"$f":"A19","v":"lutum gehalte in % d.s."}]
["organisch stofgehalte in % d.s.",null,null,{"$f":"Bodemkwaliteit!Y20","v":10},{"$f":"D20","v":10},null,null,null,null,null,null,"Eis nsg",null,null,null,null,null,null,{"$f":"F20","v":0},6.0000000000000001E-3,2E-3,null,null,null,"Rbk, B, t1","Rbk, B, t2","Zie 'Bodemkwaliteit'",null,null,null,{"$f":"A20","v":"organisch stofgehalte in % d.s."}]
[null,null,{"$f":"IF(Bodemkwaliteit!G22=1,\"C[gem]\",\"C[gem]-cor\")","v":"C[gem]-cor"},null,null,null,"toets",null,null,null,{"$f":"IF(Bodemkwaliteit!G22=0,\"E-tw\",\"E-tw cor\")","v":"E-tw"},{"$f":"IF(Bodemkwaliteit!G22=0,\"i-waarde\",\"i-waarde cor\")","v":"i-waarde"},null,null,null,null,null,null,null,null,null,null,null,"E-tw","E-tw","E-tw","a","b","c"]
[]
["Parameter, opgaven in mg/kg d.s.",null,null,null,null,null,null,">E-gtw","Egtw<x<i-waarde",">i-waarde"]
["Metalen",null,"C","D",null,"F","G","H",null,"I",null,"z",null,null,null,"AANTAL"]
[{"$f":"Bodemkwaliteit!F25","v":"barium"},null,null,{"$f":"Bodemkwaliteit!U25","v":190},null,null,{"$f":"+IF(D25>L25,\">i-waarde\",IF(D25<=K25,\"voldoet aan emissietoetswaarde\",IF(AND(D25>K25,D25<=L25),\"emissie bepalen (kolomproef L/S=10)\",\"voldoet niet\")))","v":"voldoet aan emissietoetswaarde"},{"$f":"IF(G25=\"voldoet aan emissietoetswaarde\",1,0)","v":1},{"$f":"IF(G25=\"emissie bepalen (kolomproef L/S=10)\",1,0)","v":0},{"$f":"IF(G25=\">i-waarde\",1,0)","v":0},{"$f":"IF(Bodemkwaliteit!$G$21=0,X25*Bodemkwaliteit!BV25,X25)","v":625},{"$f":"Bodemkwaliteit!AT25","v":920},null,null,1,1,null,null,{"$f":"MAX(T25:V25)","v":15},null,null,15,null,{"$f":"IF($F$4=1,Y25,Z25)","v":625},625,625,{"$f":"Bodemkwaliteit!BS25","v":30},{"$f":"Bodemkwaliteit!BT25","v":5},{"$f":"Bodemkwaliteit!BU25","v":0},null,{"$f":"A25","v":"barium"}]
[{"$f":"Bodemkwaliteit!F26","v":"cadmium"},null,null,{"$f":"Bodemkwaliteit!U26","v":0.6},null,null,"voldoet aan emissietoetswaarde",1,0,0,{"$f":"IF(Bodemkwaliteit!$G$21=0,X26*Bodemkwaliteit!BV26,X26)","v":4.3},{"$f":"Bodemkwaliteit!AT26","v":13},null,null,1,1,null,null,0.17,0.01,1E-3,0.17,null,4.3,4.3,4.3,{"$f":"Bodemkwaliteit!BS26","v":0.4},{"$f":"Bodemkwaliteit!BT26","v":7.0000000000000001E-3},{"$f":"Bodemkwaliteit!BU26","v":2.1000000000000001E-2},null,"cadmium"]
[{"$f":"Bodemkwaliteit!F27","v":"kobalt"},null,null,{"$f":"Bodemkwaliteit!U27","v":15},null,null,"voldoet aan emissietoetswaarde",1,0,0,{"$f":"IF(Bodemkwaliteit!$G$21=0,X27*Bodemkwaliteit!BV27,X27)","v":130},{"$f":"Bodemkwaliteit!AT27","v":190},null,null,1,1,null,null,1,null,null,1,null,130,130,130,{"$f":"Bodemkwaliteit!BS27","v":2},{"$f":"Bodemkwaliteit!BT27","v":0.28000000000000003},{"$f":"Bodemkwaliteit!BU27","v":0},null,"kobalt"]
[{"$f":"Bodemkwaliteit!F28","v":"koper"},null,null,{"$f":"Bodemkwaliteit!U28","v":40},null,null,"voldoet aan emissietoetswaarde",1,0,0,{"$f":"IF(Bodemkwaliteit!$G$21=0,X28*Bodemkwaliteit!BV28,X28)","v":113},{"$f":"Bodemkwaliteit!AT28","v":190},null,null,1,1,null,null,5,0.5,0.1,5,null,113,113,113,{"$f":"Bodemkwaliteit!BS28","v":15},{"$f":"Bodemkwaliteit!BT28","v":0.6},{"$f":"Bodemkwaliteit!BU28","v":0.6},null,"koper"]
[{"$f":"Bodemkwaliteit!F29","v":"kwik"},null,null,{"$f":"Bodemkwaliteit!U29","v":0.15},null,null,"voldoet aan emissietoetswaarde",1,0,0,{"$f":"IF(Bodemkwaliteit!$G$21=0,X29*Bodemkwaliteit!BV29,X29)","v":4.8},{"$f":"Bodemkwaliteit!AT29","v":36},null,null,1,1,null,null,0.05,0.03,1E-3,0.05,null,4.8,4.8,4.8,{"$f":"Bodemkwaliteit!BS29","v":0.2},{"$f":"Bodemkwaliteit!BT29","v":3.3999999999999998E-3},{"$f":"Bodemkwaliteit!BU29","v":1.6999999999999999E-3},null,{"$f":"A29","v":"kwik"}]
[{"$f":"Bodemkwaliteit!F30","v":"lood"},null,null,{"$f":"Bodemkwaliteit!U30","v":50},null,null,"voldoet aan emissietoetswaarde",1,0,0,{"$f":"IF(Bodemkwaliteit!$G$21=0,X30*Bodemkwaliteit!BV30,X30)","v":308},{"$f":"Bodemkwaliteit!AT30","v":530},null,null,1,1,null,null,13,0.2,0.05,13,null,308,308,308,{"$f":"Bodemkwaliteit!BS30","v":50},{"$f":"Bodemkwaliteit!BT30","v":1},{"$f":"Bodemkwaliteit!BU30","v":1},null,"lood"]
[{"$f":"Bodemkwaliteit!F31","v":"molybdeen"},null,null,{"$f":"Bodemkwaliteit!U31","v":0.5},null,null,"voldoet aan emissietoetswaarde",1,0,0,{"$f":"IF(Bodemkwaliteit!$G$21=0,X31*Bodemkwaliteit!BV31,X31)","v":105},{"$f":"Bodemkwaliteit!AT31","v":190},null,null,1,1,null,null,1.5,null,null,1.5,null,105,105,105,{"$f":"Bodemkwaliteit!BS31","v":1},{"$f":"Bodemkwaliteit!BT31","v":0},{"$f":"Bodemkwaliteit!BU31","v":0},null,"molybdeen"]
[{"$f":"Bodemkwaliteit!F32","v":"nikkel"},null,null,{"$f":"Bodemkwaliteit!U32","v":35},null,null,"voldoet aan emissietoetswaarde",1,0,0,{"$f":"IF(Bodemkwaliteit!$G$21=0,X32*Bodemkwaliteit!BV32,X32)","v":100},{"$f":"Bodemkwaliteit!AT32","v":100},null,null,1,1,null,null,3,0.2,0.05,3,null,100,100,100,{"$f":"Bodemkwaliteit!BS32","v":10},{"$f":"Bodemkwaliteit!BT32","v":1},{"$f":"Bodemkwaliteit!BU32","v":0},null,"nikkel"]
[{"$f":"Bodemkwaliteit!F33","v":"zink"},null,null,{"$f":"Bodemkwaliteit!U33","v":100},null,null,"voldoet aan emissietoetswaarde",1,0,0,{"$f":"IF(Bodemkwaliteit!$G$21=0,X33*Bodemkwaliteit!BV33,X33)","v":430},{"$f":"Bodemkwaliteit!AT33","v":720},null,null,1,1,null,null,17,3,1,17,null,430,430,430,{"$f":"Bodemkwaliteit!BS33","v":50},{"$f":"Bodemkwaliteit!BT33","v":3},{"$f":"Bodemkwaliteit!BU33","v":1.5},null,"zink"]
[null,null,null,null,null,null,null,{"$f":"SUM(H25:H33)","v":9},{"$f":"SUM(I25:I33)","v":0},{"$f":"SUM(J25:J33)","v":0},{"$f":"SUM(H34+I34+J34)","v":9},null,null,null,null,null,"voldoet N,T?",null,"schoon?"]
["<resultaat>","gemiddelde te toetsen gehalte",null,null,null,null,null,">AW2000",null,">i-waarde",null,null,null,null,{"$f":"SUM(O25:O33)","v":9},{"$f":"SUM(P25:P33)","v":9}]
["C","gehalte in mg/kg d.s."]
["ZF","zekerheidsfactor",null,null,null,null,null,null,null,null,null,null,null,null,null,null,null,null,{"$f":"IF((D15=6),\"Opmerking: bij methode 2*6 geen notitie >2*bsb-1\",\"\")","v":""}]
["E-gtw","Emissie grenstoetswaarde conform tabel 1 van bijlage A Rbk",null,null,null,null,null,null,null,null,null,null,null,null,null,null,null,null,{"$f":"IF((D15=6),\"dit geldt in voorkomende gevallen alleen\",\"\")","v":""}]
["i-waarde","interventiewaarde bodem"]
["toets","resultaat van de toetsing aan de emissiegrenstoetswaarden en interventiewaarden"]
[]
["Kwaliteit:",{"$f":"IF(F6=1,\"vrijstelling voor emissie-onderzoek conform Rbk, art. 4.12.2-b\",IF(OR(T9=\"niet mogelijk\",T9=\"niet toepasbare grond\",T10=\"industrie<x<i-waarde\",T10=\"niet toepasbare grond\"),\"de grond kan niet in een grootschalige toepassing worden gebruikt\",IF(AND(P1=1,H34=K34,J34=0,F13=0),\"voldoet aan grootschalige toepassing\",IF(AND(P1=1,H34=O35,J34=0,F13=1),\"de partij kan aan de bestaande grootschalige toepassing toegevoegd worden\",IF(AND(P1=1,SUM(H34+I34)=(O35),I34>=1,J34=0),T44,IF(OR(P1=0,J34>=1),\"voldoet niet aan grootschalige toepassing\",\"fout\"))))))","v":"de partij kan aan de bestaande grootschalige toepassing toegevoegd worden"},null,null,null,null,null,null,null,null,null,{"$f":"IF(B42=\"uitloging conform Bsb 2005 bepalen\",1,0)","v":0},null,null,null,null,null,null,null,{"$f":"IF(OR(B42=\"uitloging c.q. emissiewaarden bepalen en toetsen aan maximale emissiewaarden\",B42=\"conform BRL9335 systematiek is bij pH<=5 uitloging wel noodzakelijk\"),1,0)","v":0}]
[{"$f":"IF(L42=1,\"Voldoet de imissie aan de eisen? (ja=1;nee=0)\",\"\")","v":""},{"$f":"IF(T10=\"industrie<x<i-waarde\",\"de grond voldoet niet aan art. 60-1-a/60-4-c BBk\",\"\")","v":""},null,null,null,null,null,null,null,null,{"$f":"IF(OR(B42=\"voldoet aan grootschalige toepassing\",B42=\"de partij kan aan de bestaande grootschalige toepassing toegevoegd worden\"),1,0)","v":1},null,null,null,null,null,null,null,null,"uitloging c.q. emissiewaarden bepalen en toetsen aan maximale emissiewaarden"]
[{"$f":"IF(OR(K43=1,F43=1),\"De toepassing dient te voldoen aan de volgende eisen:\",IF(T10=\"industrie<x<i-waarde\",\"(de kwaliteit van de grond overschrijdt de maximale waarden voor de bodemfunctieklasse industrie\",\"\"))","v":"De toepassing dient te voldoen aan de volgende eisen:"},null,null,null,null,null,null,null,null,null,null,null,null,null,null,null,null,null,null,{"$f":"IF(AND(Bodemkwaliteit!H7=1,Bodemkwaliteit!L17>5),\"conform BRL9335 systematiek is bij pH>5 uitloging niet noodzakelijk\",IF(AND(Bodemkwaliteit!H7=1,Bodemkwaliteit!L17<=5),\"conform BRL9335 systematiek is bij pH<=5 uitloging wel noodzakelijk\",T43))","v":"uitloging c.q. emissiewaarden bepalen en toetsen aan maximale emissiewaarden"}]
[{"$f":"IF(A44=\"\",\"\",\"- er wordt een leeflaag toegepast met een dikte van 0,5 m of dikker;\")","v":"- er wordt een leeflaag toegepast met een dikte van 0,5 m of dikker;"}]
[{"$f":"IF(A44=\"\",\"\",\"- de leeflaag voldoet aan de strengste eis van zonefunctie en zonekwaliteit (toepassingseis);\")","v":"- de leeflaag voldoet aan de strengste eis van zonefunctie en zonekwaliteit (toepassingseis);"}]
[{"$f":"IF(A44=\"\",\"\",\"- de bodemtoepassing is geregistreerd bij het kadaster of in een bodeminformatiesysteem;\")","v":"- de bodemtoepassing is geregistreerd bij het kadaster of in een bodeminformatiesysteem;"}]
[{"$f":"IF(A44=\"\",\"\",\"- de bodemtoepassing heeft een aanwijsbare beheerder.\")","v":"- de bodemtoepassing heeft een aanwijsbare beheerder."}]
[{"$f":"IF(A44=\"\",\"\",\"NB: voor een bodemtoepassing die aan de eisen van Bbk en Rbk voldoet bestaat binnen het Bbk geen verwijderingsplicht.\")","v":"NB: voor een bodemtoepassing die aan de eisen van Bbk en Rbk voldoet bestaat binnen het Bbk geen verwijderingsplicht."}]
[{"$f":"IF(OR(G25=\"emissie bepalen (kolomproef L/S=10)\",G25=\"voldoet niet\"),\"Met bevoegd gezag overleggen of uitloging Barium bepaald moet worden.\",\"\")","v":""}]
["Kwaliteitscontrole van de hierboven gesteld conclusie:"]
[]
["Naam toetser:",null,null,"Paraaf:",null,null,"Datum:"]
[]
["Naam 2e lezer:",null,null,"Paraaf:",null,null,"Datum:"]

{"sheet":"In opp.water","index":4,"n_rows":83,"n_cols":70,"rows_kept":83,"cut":false,"hidden":false,"merged":[[11,6,12,6],[11,4,12,4],[11,49,12,49],[11,42,11,47],[12,17,12,18],[12,24,12,25],[12,27,12,28],[12,30,12,31],[12,33,12,34],[4,6,4,9],[2,9,2,28],[3,9,3,28],[12,36,12,37],[12,39,12,40],[11,30,11,32],[11,33,11,35],[11,36,11,38],[11,39,11,41],[12,10,12,12],[2,30,2,43],[3,30,3,43],[11,10,11,16],[11,17,11,23],[11,24,11,26],[11,27,11,29]]}
[null,"Regeling Bodemkwaliteit, Bijlage 2, tabel 2: Normwaarden voor toepassen van grond en baggerspecie in oppervlaktewater en"]
[null,"voor de bodem onder oppervlaktewater waarop grond of baggerspecie wordt toegepast."]
[null,"Projectcode: ",null,null,null,null,null,null,null,{"$f":"Bodemkwaliteit!H3","v":"< code >"},null,null,null,null,null,null,null,null,null,null,null,null,null,null,null,null,null,null,null,null,{"$f":"Bodemkwaliteit!L3","v":"Partij < partijnaam >"}]
[null,"Datum toetsing:",null,null,null,null,null,null,null,{"$f":"Bodemkwaliteit!H4","v":"<datum>"},null,null,null,null,null,null,null,null,null,null,null,null,null,null,null,null,null,null,null,null,{"$f":"IF(Bodemkwaliteit!L4=\"\",\"\",Bodemkwaliteit!L4)","v":"< meldnummer >"}]
[null,"Zekerheidsfactor:",null,null,null,null,{"$f":"Bodemkwaliteit!Q6","v":1},null,null,null,"=ZF"]
[null,"grepen:","2 maal ",null,null,null,null,null,null,null,{"$f":"Bodemkwaliteit!J15","v":50},null,null,null,null,null,null,null,null,null,null,null,null,null,null,null,null,null,null,null,null,null,null,null,null,null,null,null,null,null,null,null,null,null,null,null,null,null,null,null,null,null,null,null,null,null,"bg of ag","bg","ag","Labo-d","AS3000"]
[null,"Macroparameters",null,null,null,null,null,null,null,null,null,null,null,null,null,null,null,null,null,null,null,null,null,null,null,null,null,null,null,null,null,null,null,null,null,null,null,null,null,null,null,null,null,null,null,null,null,null,null,null,null,null,null,null,null,null,null,null,null,null,"AG r,eis"]
[null,"zuurgraad",null,null,null,null,null,null,null,null,{"$f":"Bodemkwaliteit!Y17","v":7},null,null,null,null,null,null,null,null,null,null,null,null,null,null,null,null,null,null,null,null,null,null,null,null,null,null,null,null,null,null,null,null,null,null,null,null,null,null,null,null,null,null,null,null,null,null,{"$f":"Bodemkwaliteit!BE18","v":0},{"$f":"Bodemkwaliteit!BF18","v":"n.v.t."},{"$f":"Bodemkwaliteit!BG18","v":0},{"$f":"Bodemkwaliteit!BH18","v":"n.v.t."},null,null,null,null,null,null,null,null,{"$f":"B8","v":"zuurgraad"}]
[null,"droge stof gehalte (massa-%)",null,null,null,null,null,null,null,null,{"$f":"Bodemkwaliteit!Y18","v":100},null,null,null,null,null,null,null,null,null,null,null,null,null,null,null,null,null,null,null,null,null,null,null,null,null,null,null,null,null,null,null,null,null,null,null,null,null,null,null,null,null,null,null,null,null,null,{"$f":"Bodemkwaliteit!BE19","v":3.0000000000000001E-3},{"$f":"Bodemkwaliteit!BF19","v":1E-3},{"$f":"Bodemkwaliteit!BG19","v":0},{"$f":"Bodemkwaliteit!BH19","v":"n.v.t."},null,null,null,null,null,null,null,null,{"$f":"B9","v":"droge stof gehalte (massa-%)"}]
[null,"lutum gehalte in % d.s.",null,null,null,null,null,null,null,null,{"$f":"Bodemkwaliteit!Y19","v":25},null,{"$f":"BD10","v":25},{"$f":"IF(K10<2,2,K10)","v":25},null,null,null,null,null,null,null,null,null,null,null,null,null,null,null,null,null,null,null,null,null,null,null,null,null,null,null,null,null,null,null,null,null,null,null,null,null,null,null,null,null,{"$f":"N10","v":25},null,{"$f":"Bodemkwaliteit!BE20","v":1.4999999999999999E-2},{"$f":"Bodemkwaliteit!BF20","v":5.0000000000000001E-3},{"$f":"Bodemkwaliteit!BG20","v":0},{"$f":"Bodemkwaliteit!BH20","v":0.01},null,null,null,null,null,null,null,null,{"$f":"B10","v":"lutum gehalte in % d.s."}]
[null,"organisch stofgehalte in % d.s.",null,null,null,null,{"$f":"Bodemkwaliteit!Y20","v":10},null,null,null,{"$f":"Bodemkwaliteit!Z20","v":10},null,{"$f":"BD11","v":10},{"$f":"+IF(K11>30,30,IF(K11<2,2,K11))","v":10},null,null,null,null,null,null,null,null,null,null,null,null,null,"Eis sg",null,null,null,null,null,null,null,null,null,null,null,null,null,null,null,null,null,null,null,null,null,null,null,null,null,null,null,{"$f":"N11","v":10},null,{"$f":"Bodemkwaliteit!BE22","v":6.0000000000000001E-3},{"$f":"Bodemkwaliteit!BF22","v":2E-3},{"$f":"Bodemkwaliteit!BG22","v":0},{"$f":"Bodemkwaliteit!BH22","v":2E-3},null,"bg","ag","d",null,null,null,null,{"$f":"B11","v":"organisch stofgehalte in % d.s."}]
[null,null,null,null,"[C- gem.]",null,"[C- stand- aard]",null,null,null,"AGW",null,null,null,null,null,null,"verspreiden\naangrenzend\nperceel",null,null,null,null,null,null,"bkk\nwonen",null,null,"kwaliteits\nklasse A\n=HVN Rijn",null,null,"kwaliteits\nklasse B\n=i-waarde bodem onder opp.water",null,null,"bf- klasse\nindustrie",null,null,"min kkB en Bf-k ind.",null,null,"i-waarde\ndroge\nbodem",null,null,"verspreiden\nin zout\nwater (=CTT)",null,null,null,null,null,null,"prio-ri-tair?"]
[null,null,null,null,null,"C*ZF",null,null,"N gemeten en agw","AGW/ BG/ d","> agw?",null,null,"A >agw","A voldoet art. 4.2.2.-4 en -5\nx>agw en x<2*agw en <bkk w en <kk A","A voldoet","A voldoet niet","mogelijk?",null,"Cd<7,5?","m.o.<3000?","A ja","A nee","A ber",">bkk w?",null,"A > bkk w","> kkA?",null,"A >kkA","> kkB?",null,"A >kkB","> Bf-k ind.?",null,"A >Bf-ki","> dit min.?",null,"A > min kkB/Bf-k ind.","> i-waarde?",null,"A >i",null,"> CCT?","> 1,5* CCT?","A > CCT",">  CCT +50%?",null,null,null,null,"N",null,null,null,null,null,null,null,null,null,null,null,null,null,"a","b","c"]
[]
[null,"Parameter, opgaven in mg/kg d.s.",null,null,null,null,null,null,null,null,null,"N agw",null,null,null,null,null,"x","ber.msPAF"]
[null,"1. Metalen",null,"C","D",null,"E","F",null,null,null,null,null,null,null,null,null,null,null,null,null,null,null,null,null,null,null,null,null,null,null,null,null,null,null,null,null,null,null,null,null,null,null,null,null,null,null,null,null,null,null,"AANTAL",null,null,null,null,null,null,null,null,null,null,null,null,null,null,null,null,null,{"$f":"B16","v":"1. Metalen"}]
[null,{"$f":"Bodemkwaliteit!F25","v":"barium"},"L=",{"$f":"(IF(Bodemkwaliteit!AC14=1,(IF(M10<10,10,$M$10)),M10))","v":25},{"$f":"IF(AND(Bodemkwaliteit!H25=\"<\",Bodemkwaliteit!J25=\"<\"),\"<d\",Bodemkwaliteit!Q25)","v":190},{"$f":"IF(E17=\"<d\",\"<d\",E17*$G$5)","v":190},{"$f":"IF(E17=\"<d\",J17,F17*(BN17+BO17*25+BP17*10)/(BN17+$M$10*BO17+BP17*$G$11))","v":190},null,{"$f":"IF(AND(G17>0,L17=1),1,0)","v":1},{"$f":"IF(BE17<K17,BE17,K17)","v":20},{"$f":"IF(Bodemkwaliteit!BJ25=\"\",\"-\",Bodemkwaliteit!BJ25)","v":920},{"$f":"IF(K17=\"-\",0,1)","v":1},{"$f":"IF(G17>K17,\"> agw\",\"\")","v":""},{"$f":"IF(K17=\"-\",\"\",IF(M17=\"> agw\",1,0))","v":0},{"$f":"IF(K17=\"-\",\"\",IF(AND(G17>K17,G17<2*K17,G17<Y17,G17<AE17),1,0))","v":0},{"$f":"IF(K17=\"-\",\"\",IF(AND(N17=1,O17=1),1,0))","v":0},{"$f":"IF(K17=\"-\",\"\",IF(AND(N17=1,O17=0),1,0))","v":0},"x",{"$f":"IF(M17=\"\",\"\",IF(AND(M17=\"> agw\",R17=\"x\"),\"ber. msPAF\",IF(R17=\"-\",\"\",IF(G17>R17,\"nee\",\"ja\"))))","v":""},null,null,{"$f":"IF(S17=\"\",\"\",IF(S17=\"ja\",1,0))","v":""},{"$f":"IF(S17=\"\",\"\",IF(S17=\"nee\",1,0))","v":""},{"$f":"IF(S17=\"\",\"\",IF(OR(S17=\"ber. msPAF\",S17=\"ja, ber. msPAF\"),1,0))","v":""},{"$f":"IF(Bodemkwaliteit!BK25=\"\",\"-\",Bodemkwaliteit!BK25)","v":920},{"$f":"IF(G17>Y17,\"> bkk w\",\"\")","v":""},{"$f":"IF(Z17=\"> bkk w\",1,0)","v":0},625,{"$f":"IF(G17>AB17,\"> kkA\",\"\")","v":""},{"$f":"IF(AC17=\"> kkA\",1,0)","v":0},625,{"$f":"IF(G17>AE17,\"> kkB\",\"\")","v":""},{"$f":"IF(AF17=\"> kkB\",1,0)","v":0},{"$f":"IF(Bodemkwaliteit!BL25=\"\",\"-\",Bodemkwaliteit!BL25)","v":920},{"$f":"IF(G17>AH17,\"> bfk industrie\",\"\")","v":""},{"$f":"IF(AI17=\"> bfk industrie\",1,0)","v":0},{"$f":"IF(AND(AE17=\"-\",AH17=\"-\"),\"-\",MIN(AE17,AH17))","v":625},{"$f":"IF(G17>AK17,\"> min\",\"\")","v":""},{"$f":"IF(AL17=\"> min\",1,0)","v":0},{"$f":"IF(Bodemkwaliteit!BO25=\"\",\"-\",Bodemkwaliteit!BO25)","v":920},{"$f":"IF(AN17=\"\",\"\",IF(G17>AN17,\"> i-waarde\",\"\"))","v":""},{"$f":"IF(AO17=\"> i-waarde\",1,0)","v":0},"-",{"$f":"IF(OR(E17=\"<d\",AQ17=\"-\"),\"\",IF(E17>AQ17,\"> CCT\",\"\"))","v":""},{"$f":"IF(AQ17=\"-\",\"\",IF(G17>1.5*AQ17,\"> 1,5*CCT\",\"\"))","v":""},{"$f":"IF(AR17=\"> CCT\",1,0)","v":0},{"$f":"IF(AX17=\"\",\"\",IF(AX17=\"ja\",\"\",IF(AS17=\"> 1,5*CCT\",1,0)))","v":0},{"$f":"IF(AND(AT17=1,AU17=0),1,0)","v":0},null,"nee",null,1,null,null,null,{"$f":"L17","v":1},{"$f":"IF(AND(Bodemkwaliteit!AF25=1,Bodemkwaliteit!AG25=1),MAX(BH17,IF($G$5=1,BF17,BG17)),IF($G$5=1,BF17,BG17))","v":20},{"$f":"Bodemkwaliteit!BE25","v":20},{"$f":"Bodemkwaliteit!BF25","v":13},{"$f":"Bodemkwaliteit!BG25","v":15},{"$f":"Bodemkwaliteit!BH25","v":15},null,{"$f":"IF(ISNONTEXT(BF17)=TRUE,1,0)","v":1},1,{"$f":"IF(ISNONTEXT(BJ17)=TRUE,1,0)","v":1},{"$f":"Bodemkwaliteit!BS25","v":30},{"$f":"Bodemkwaliteit!BT25","v":5},{"$f":"Bodemkwaliteit!BU25","v":0},null,{"$f":"B17","v":"barium"}]
[null,{"$f":"Bodemkwaliteit!F26","v":"cadmium"},null,null,{"$f":"IF(AND(Bodemkwaliteit!H26=\"<\",Bodemkwaliteit!J26=\"<\"),\"<d\",Bodemkwaliteit!Q26)","v":0.6},0.6,0.6,null,{"$f":"IF(AND(G18>0,L18=1),1,0)","v":1},0.2,{"$f":"IF(Bodemkwaliteit!BJ26=\"\",\"-\",Bodemkwaliteit!BJ26)","v":0.6},{"$f":"IF(K18=\"-\",0,1)","v":1},{"$f":"IF(G18>K18,\"> agw\",\"\")","v":""},{"$f":"IF(K18=\"-\",\"\",IF(M18=\"> agw\",1,0))","v":0},{"$f":"IF(K18=\"-\",\"\",IF(AND(G18>K18,G18<2*K18,G18<Y18,G18<AE18),1,0))","v":0},{"$f":"IF(K18=\"-\",\"\",IF(AND(N18=1,O18=1),1,0))","v":0},{"$f":"IF(K18=\"-\",\"\",IF(AND(N18=1,O18=0),1,0))","v":0},7.5,{"$f":"IF(M18=\"\",\"\",IF(AND(M18=\"> agw\",R18=\"x\"),\"ber. msPAF\",IF(R18=\"-\",\"\",IF(G18>R18,\"nee\",\"ja\"))))","v":""},{"$f":"IF(G18<R18,1,0)","v":1},null,{"$f":"IF(S18=\"\",\"\",IF(S18=\"ja\",1,0))","v":""},{"$f":"IF(S18=\"\",\"\",IF(S18=\"nee\",1,0))","v":""},{"$f":"IF(S18=\"\",\"\",IF(OR(S18=\"ber. msPAF\",S18=\"ja, ber. msPAF\"),1,0))","v":""},{"$f":"IF(Bodemkwaliteit!BK26=\"\",\"-\",Bodemkwaliteit!BK26)","v":1.2},{"$f":"IF(G18>Y18,\"> bkk w\",\"\")","v":""},{"$f":"IF(Z18=\"> bkk w\",1,0)","v":0},4,{"$f":"IF(G18>AB18,\"> kkA\",\"\")","v":""},{"$f":"IF(AC18=\"> kkA\",1,0)","v":0},14,{"$f":"IF(G18>AE18,\"> kkB\",\"\")","v":""},{"$f":"IF(AF18=\"> kkB\",1,0)","v":0},{"$f":"IF(Bodemkwaliteit!BL26=\"\",\"-\",Bodemkwaliteit!BL26)","v":4.3},{"$f":"IF(G18>AH18,\"> bfk industrie\",\"\")","v":""},{"$f":"IF(AI18=\"> bfk industrie\",1,0)","v":0},4.3,{"$f":"IF(G18>AK18,\"> min\",\"\")","v":""},{"$f":"IF(AL18=\"> min\",1,0)","v":0},{"$f":"IF(Bodemkwaliteit!BO26=\"\",\"-\",Bodemkwaliteit!BO26)","v":13},"",{"$f":"IF(AO18=\"> i-waarde\",1,0)","v":0},4,{"$f":"IF(OR(E18=\"<d\",AQ18=\"-\"),\"\",IF(E18>AQ18,\"> CCT\",\"\"))","v":""},{"$f":"IF(AQ18=\"-\",\"\",IF(G18>1.5*AQ18,\"> 1,5*CCT\",\"\"))","v":""},{"$f":"IF(AR18=\"> CCT\",1,0)","v":0},{"$f":"IF(AX18=\"\",\"\",IF(AX18=\"ja\",\"\",IF(AS18=\"> 1,5*CCT\",1,0)))","v":""},{"$f":"IF(AND(AT18=1,AU18=0),1,0)","v":0},null,"ja",null,1,null,null,null,{"$f":"L18","v":1},{"$f":"IF(AND(Bodemkwaliteit!AF26=1,Bodemkwaliteit!AG26=1),MAX(BH18,IF($G$5=1,BF18,BG18)),IF($G$5=1,BF18,BG18))","v":0.2},{"$f":"Bodemkwaliteit!BE26","v":0.2},{"$f":"Bodemkwaliteit!BF26","v":0.1},{"$f":"Bodemkwaliteit!BG26","v":0.17},{"$f":"Bodemkwaliteit!BH26","v":0.17},null,1,1,{"$f":"IF(ISNONTEXT(BJ18)=TRUE,1,0)","v":1},{"$f":"Bodemkwaliteit!BS26","v":0.4},{"$f":"Bodemkwaliteit!BT26","v":7.0000000000000001E-3},{"$f":"Bodemkwaliteit!BU26","v":2.1000000000000001E-2},null,{"$f":"B18","v":"cadmium"}]
[null,{"$f":"Bodemkwaliteit!F27","v":"kobalt"},null,null,{"$f":"IF(AND(Bodemkwaliteit!H27=\"<\",Bodemkwaliteit!J27=\"<\"),\"<d\",Bodemkwaliteit!Q27)","v":15},15,15,null,{"$f":"IF(AND(G19>0,L19=1),1,0)","v":1},3,{"$f":"IF(Bodemkwaliteit!BJ27=\"\",\"-\",Bodemkwaliteit!BJ27)","v":15},{"$f":"IF(K19=\"-\",0,1)","v":1},{"$f":"IF(G19>K19,\"> agw\",\"\")","v":""},{"$f":"IF(K19=\"-\",\"\",IF(M19=\"> agw\",1,0))","v":0},{"$f":"IF(K19=\"-\",\"\",IF(AND(G19>K19,G19<2*K19,G19<Y19,G19<AE19),1,0))","v":0},{"$f":"IF(K19=\"-\",\"\",IF(AND(N19=1,O19=1),1,0))","v":0},{"$f":"IF(K19=\"-\",\"\",IF(AND(N19=1,O19=0),1,0))","v":0},"x",{"$f":"IF(M19=\"\",\"\",IF(AND(M19=\"> agw\",R19=\"x\"),\"ber. msPAF\",IF(R19=\"-\",\"\",IF(G19>R19,\"nee\",\"ja\"))))","v":""},null,null,{"$f":"IF(S19=\"\",\"\",IF(S19=\"ja\",1,0))","v":""},{"$f":"IF(S19=\"\",\"\",IF(S19=\"nee\",1,0))","v":""},{"$f":"IF(S19=\"\",\"\",IF(OR(S19=\"ber. msPAF\",S19=\"ja, ber. msPAF\"),1,0))","v":""},{"$f":"IF(Bodemkwaliteit!BK27=\"\",\"-\",Bodemkwaliteit!BK27)","v":35},{"$f":"IF(G19>Y19,\"> bkk w\",\"\")","v":""},{"$f":"IF(Z19=\"> bkk w\",1,0)","v":0},25,{"$f":"IF(G19>AB19,\"> kkA\",\"\")","v":""},{"$f":"IF(AC19=\"> kkA\",1,0)","v":0},240,{"$f":"IF(G19>AE19,\"> kkB\",\"\")","v":""},{"$f":"IF(AF19=\"> kkB\",1,0)","v":0},{"$f":"IF(Bodemkwaliteit!BL27=\"\",\"-\",Bodemkwaliteit!BL27)","v":190},{"$f":"IF(G19>AH19,\"> bfk industrie\",\"\")","v":""},{"$f":"IF(AI19=\"> bfk industrie\",1,0)","v":0},190,{"$f":"IF(G19>AK19,\"> min\",\"\")","v":""},{"$f":"IF(AL19=\"> min\",1,0)","v":0},{"$f":"IF(Bodemkwaliteit!BO27=\"\",\"-\",Bodemkwaliteit!BO27)","v":190},"",{"$f":"IF(AO19=\"> i-waarde\",1,0)","v":0},"-",{"$f":"IF(OR(E19=\"<d\",AQ19=\"-\"),\"\",IF(E19>AQ19,\"> CCT\",\"\"))","v":""},{"$f":"IF(AQ19=\"-\",\"\",IF(G19>1.5*AQ19,\"> 1,5*CCT\",\"\"))","v":""},{"$f":"IF(AR19=\"> CCT\",1,0)","v":0},{"$f":"IF(AX19=\"\",\"\",IF(AX19=\"ja\",\"\",IF(AS19=\"> 1,5*CCT\",1,0)))","v":""},{"$f":"IF(AND(AT19=1,AU19=0),1,0)","v":0},null,"ja",null,1,null,null,null,{"$f":"L19","v":1},{"$f":"IF(AND(Bodemkwaliteit!AF27=1,Bodemkwaliteit!AG27=1),MAX(BH19,IF($G$5=1,BF19,BG19)),IF($G$5=1,BF19,BG19))","v":3},{"$f":"Bodemkwaliteit!BE27","v":3},{"$f":"Bodemkwaliteit!BF27","v":0.7},{"$f":"Bodemkwaliteit!BG27","v":1},{"$f":"Bodemkwaliteit!BH27","v":1},null,{"$f":"IF(ISNONTEXT(BF19)=TRUE,1,0)","v":1},{"$f":"IF(ISNONTEXT(BG19)=TRUE,1,0)","v":1},{"$f":"IF(ISNONTEXT(BJ19)=TRUE,1,0)","v":1},{"$f":"Bodemkwaliteit!BS27","v":2},{"$f":"Bodemkwaliteit!BT27","v":0.28000000000000003},{"$f":"Bodemkwaliteit!BU27","v":0},null,{"$f":"B19","v":"kobalt"}]
[null,{"$f":"Bodemkwaliteit!F28","v":"koper"},null,null,{"$f":"IF(AND(Bodemkwaliteit!H28=\"<\",Bodemkwaliteit!J28=\"<\"),\"<d\",Bodemkwaliteit!Q28)","v":40},40,40,null,1,5,{"$f":"IF(Bodemkwaliteit!BJ28=\"\",\"-\",Bodemkwaliteit!BJ28)","v":40},1,"",0,0,0,0,"x","",null,null,"","","",{"$f":"IF(Bodemkwaliteit!BK28=\"\",\"-\",Bodemkwaliteit!BK28)","v":54},"",0,96,"",0,190,"",0,{"$f":"IF(Bodemkwaliteit!BL28=\"\",\"-\",Bodemkwaliteit!BL28)","v":190},"",0,190,"",0,{"$f":"IF(Bodemkwaliteit!BO28=\"\",\"-\",Bodemkwaliteit!BO28)","v":190},"",0,60,"","",0,"",0,null,"ja",null,1,null,null,null,1,{"$f":"IF(AND(Bodemkwaliteit!AF28=1,Bodemkwaliteit!AG28=1),MAX(BH20,IF($G$5=1,BF20,BG20)),IF($G$5=1,BF20,BG20))","v":5},{"$f":"Bodemkwaliteit!BE28","v":5},{"$f":"Bodemkwaliteit!BF28","v":1.7},{"$f":"Bodemkwaliteit!BG28","v":5},{"$f":"Bodemkwaliteit!BH28","v":5},null,1,1,1,{"$f":"Bodemkwaliteit!BS28","v":15},{"$f":"Bodemkwaliteit!BT28","v":0.6},{"$f":"Bodemkwaliteit!BU28","v":0.6},null,"koper"]
[null,{"$f":"Bodemkwaliteit!F29","v":"kwik"},null,null,{"$f":"IF(AND(Bodemkwaliteit!H29=\"<\",Bodemkwaliteit!J29=\"<\"),\"<d\",Bodemkwaliteit!Q29)","v":0.15},0.15,0.15,null,1,0.05,{"$f":"IF(Bodemkwaliteit!BJ29=\"\",\"-\",Bodemkwaliteit!BJ29)","v":0.15},1,"",0,0,0,0,"x","",null,null,"","","",{"$f":"IF(Bodemkwaliteit!BK29=\"\",\"-\",Bodemkwaliteit!BK29)","v":0.83},"",0,1.2,"",0,10,"",0,{"$f":"IF(Bodemkwaliteit!BL29=\"\",\"-\",Bodemkwaliteit!BL29)","v":4.8},"",0,4.8,"",0,{"$f":"IF(Bodemkwaliteit!BO29=\"\",\"-\",Bodemkwaliteit!BO29)","v":36},"",0,1.2,"","",0,"",0,null,"ja",null,1,null,null,null,1,{"$f":"IF(AND(Bodemkwaliteit!AF29=1,Bodemkwaliteit!AG29=1),MAX(BH21,IF($G$5=1,BF21,BG21)),IF($G$5=1,BF21,BG21))","v":0.05},{"$f":"Bodemkwaliteit!BE29","v":0.05},{"$f":"Bodemkwaliteit!BF29","v":0.01},{"$f":"Bodemkwaliteit!BG29","v":0.05},{"$f":"Bodemkwaliteit!BH29","v":0.05},null,1,1,1,{"$f":"Bodemkwaliteit!BS29","v":0.2},{"$f":"Bodemkwaliteit!BT29","v":3.3999999999999998E-3},{"$f":"Bodemkwaliteit!BU29","v":1.6999999999999999E-3},null,"kwik"]
[null,{"$f":"Bodemkwaliteit!F30","v":"lood"},null,null,{"$f":"IF(AND(Bodemkwaliteit!H30=\"<\",Bodemkwaliteit!J30=\"<\"),\"<d\",Bodemkwaliteit!Q30)","v":50},50,50,null,1,10,{"$f":"IF(Bodemkwaliteit!BJ30=\"\",\"-\",Bodemkwaliteit!BJ30)","v":50},1,"",0,0,0,0,"x","",null,null,"","","",{"$f":"IF(Bodemkwaliteit!BK30=\"\",\"-\",Bodemkwaliteit!BK30)","v":210},"",0,138,"",0,580,"",0,{"$f":"IF(Bodemkwaliteit!BL30=\"\",\"-\",Bodemkwaliteit!BL30)","v":530},"",0,530,"",0,{"$f":"IF(Bodemkwaliteit!BO30=\"\",\"-\",Bodemkwaliteit!BO30)","v":530},"",0,110,"","",0,"",0,null,"ja",null,1,null,null,null,1,{"$f":"IF(AND(Bodemkwaliteit!AF30=1,Bodemkwaliteit!AG30=1),MAX(BH22,IF($G$5=1,BF22,BG22)),IF($G$5=1,BF22,BG22))","v":10},{"$f":"Bodemkwaliteit!BE30","v":10},{"$f":"Bodemkwaliteit!BF30","v":1},{"$f":"Bodemkwaliteit!BG30","v":3},{"$f":"Bodemkwaliteit!BH30","v":3},null,1,1,1,{"$f":"Bodemkwaliteit!BS30","v":50},{"$f":"Bodemkwaliteit!BT30","v":1},{"$f":"Bodemkwaliteit!BU30","v":1},null,"lood"]
[null,{"$f":"Bodemkwaliteit!F31","v":"molybdeen"},null,null,{"$f":"IF(AND(Bodemkwaliteit!H31=\"<\",Bodemkwaliteit!J31=\"<\"),\"<d\",Bodemkwaliteit!Q31)","v":0.5},0.5,0.5,null,{"$f":"IF(AND(G23>0,L23=1),1,0)","v":1},1.5,{"$f":"IF(Bodemkwaliteit!BJ31=\"\",\"-\",Bodemkwaliteit!BJ31)","v":1.5},{"$f":"IF(K23=\"-\",0,1)","v":1},{"$f":"IF(G23>K23,\"> agw\",\"\")","v":""},{"$f":"IF(K23=\"-\",\"\",IF(M23=\"> agw\",1,0))","v":0},{"$f":"IF(K23=\"-\",\"\",IF(AND(G23>K23,G23<2*K23,G23<Y23,G23<AE23),1,0))","v":0},{"$f":"IF(K23=\"-\",\"\",IF(AND(N23=1,O23=1),1,0))","v":0},{"$f":"IF(K23=\"-\",\"\",IF(AND(N23=1,O23=0),1,0))","v":0},"x",{"$f":"IF(M23=\"\",\"\",IF(AND(M23=\"> agw\",R23=\"x\"),\"ber. msPAF\",IF(R23=\"-\",\"\",IF(G23>R23,\"nee\",\"ja\"))))","v":""},null,null,{"$f":"IF(S23=\"\",\"\",IF(S23=\"ja\",1,0))","v":""},{"$f":"IF(S23=\"\",\"\",IF(S23=\"nee\",1,0))","v":""},{"$f":"IF(S23=\"\",\"\",IF(OR(S23=\"ber. msPAF\",S23=\"ja, ber. msPAF\"),1,0))","v":""},{"$f":"IF(Bodemkwaliteit!BK31=\"\",\"-\",Bodemkwaliteit!BK31)","v":88},{"$f":"IF(G23>Y23,\"> bkk w\",\"\")","v":""},{"$f":"IF(Z23=\"> bkk w\",1,0)","v":0},5,{"$f":"IF(G23>AB23,\"> kkA\",\"\")","v":""},{"$f":"IF(AC23=\"> kkA\",1,0)","v":0},200,{"$f":"IF(G23>AE23,\"> kkB\",\"\")","v":""},{"$f":"IF(AF23=\"> kkB\",1,0)","v":0},{"$f":"IF(Bodemkwaliteit!BL31=\"\",\"-\",Bodemkwaliteit!BL31)","v":190},{"$f":"IF(G23>AH23,\"> bfk industrie\",\"\")","v":""},{"$f":"IF(AI23=\"> bfk industrie\",1,0)","v":0},190,{"$f":"IF(G23>AK23,\"> min\",\"\")","v":""},{"$f":"IF(AL23=\"> min\",1,0)","v":0},{"$f":"IF(Bodemkwaliteit!BO31=\"\",\"-\",Bodemkwaliteit!BO31)","v":190},"",{"$f":"IF(AO23=\"> i-waarde\",1,0)","v":0},"-",{"$f":"IF(OR(E23=\"<d\",AQ23=\"-\"),\"\",IF(E23>AQ23,\"> CCT\",\"\"))","v":""},{"$f":"IF(AQ23=\"-\",\"\",IF(G23>1.5*AQ23,\"> 1,5*CCT\",\"\"))","v":""},{"$f":"IF(AR23=\"> CCT\",1,0)","v":0},{"$f":"IF(AX23=\"\",\"\",IF(AX23=\"ja\",\"\",IF(AS23=\"> 1,5*CCT\",1,0)))","v":0},{"$f":"IF(AND(AT23=1,AU23=0),1,0)","v":0},null,"nee",null,1,null,null,null,{"$f":"L23","v":1},{"$f":"IF(AND(Bodemkwaliteit!AF31=1,Bodemkwaliteit!AG31=1),MAX(BH23,IF($G$5=1,BF23,BG23)),IF($G$5=1,BF23,BG23))","v":1.5},{"$f":"Bodemkwaliteit!BE31","v":1.5},{"$f":"Bodemkwaliteit!BF31","v":0.5},{"$f":"Bodemkwaliteit!BG31","v":0.5},{"$f":"Bodemkwaliteit!BH31","v":0.5},null,{"$f":"IF(ISNONTEXT(BF23)=TRUE,1,0)","v":1},{"$f":"IF(ISNONTEXT(BG23)=TRUE,1,0)","v":1},{"$f":"IF(ISNONTEXT(BJ23)=TRUE,1,0)","v":1},{"$f":"Bodemkwaliteit!BS31","v":1},{"$f":"Bodemkwaliteit!BT31","v":0},{"$f":"Bodemkwaliteit!BU31","v":0},null,{"$f":"B23","v":"molybdeen"}]
[null,{"$f":"Bodemkwaliteit!F32","v":"nikkel"},null,null,{"$f":"IF(AND(Bodemkwaliteit!H32=\"<\",Bodemkwaliteit!J32=\"<\"),\"<d\",Bodemkwaliteit!Q32)","v":35},35,35,null,1,4,{"$f":"IF(Bodemkwaliteit!BJ32=\"\",\"-\",Bodemkwaliteit!BJ32)","v":35},1,"",0,0,0,0,"x","",null,null,"","","",{"$f":"IF(Bodemkwaliteit!BK32=\"\",\"-\",Bodemkwaliteit!BK32)","v":70},"",0,138,"",0,210,"",0,{"$f":"IF(Bodemkwaliteit!BL32=\"\",\"-\",Bodemkwaliteit!BL32)","v":100},"",0,100,"",0,{"$f":"IF(Bodemkwaliteit!BO32=\"\",\"-\",Bodemkwaliteit!BO32)","v":100},"",0,45,"","",0,"",0,null,"ja",null,1,null,null,null,1,{"$f":"IF(AND(Bodemkwaliteit!AF32=1,Bodemkwaliteit!AG32=1),MAX(BH24,IF($G$5=1,BF24,BG24)),IF($G$5=1,BF24,BG24))","v":4},{"$f":"Bodemkwaliteit!BE32","v":4},{"$f":"Bodemkwaliteit!BF32","v":4.3},{"$f":"Bodemkwaliteit!BG32","v":13},{"$f":"Bodemkwaliteit!BH32","v":13},null,1,1,1,{"$f":"Bodemkwaliteit!BS32","v":10},{"$f":"Bodemkwaliteit!BT32","v":1},{"$f":"Bodemkwaliteit!BU32","v":0},null,"nikkel"]
[null,{"$f":"Bodemkwaliteit!F33","v":"zink"},null,null,{"$f":"IF(AND(Bodemkwaliteit!H33=\"<\",Bodemkwaliteit!J33=\"<\"),\"<d\",Bodemkwaliteit!Q33)","v":100},100,100,null,1,20,{"$f":"IF(Bodemkwaliteit!BJ33=\"\",\"-\",Bodemkwaliteit!BJ33)","v":140},1,"",0,0,0,0,"x","",null,null,"","","",{"$f":"IF(Bodemkwaliteit!BK33=\"\",\"-\",Bodemkwaliteit!BK33)","v":200},"",0,563,"",0,2000,"",0,{"$f":"IF(Bodemkwaliteit!BL33=\"\",\"-\",Bodemkwaliteit!BL33)","v":720},"",0,720,"",0,{"$f":"IF(Bodemkwaliteit!BO33=\"\",\"-\",Bodemkwaliteit!BO33)","v":720},"",0,365,"","",0,0,0,null,"nee",null,1,null,null,null,1,{"$f":"IF(AND(Bodemkwaliteit!AF33=1,Bodemkwaliteit!AG33=1),MAX(BH25,IF($G$5=1,BF25,BG25)),IF($G$5=1,BF25,BG25))","v":20},{"$f":"Bodemkwaliteit!BE33","v":20},{"$f":"Bodemkwaliteit!BF33","v":7},{"$f":"Bodemkwaliteit!BG33","v":17},{"$f":"Bodemkwaliteit!BH33","v":17},null,1,1,1,{"$f":"Bodemkwaliteit!BS33","v":50},{"$f":"Bodemkwaliteit!BT33","v":3},{"$f":"Bodemkwaliteit!BU33","v":1.5},null,"zink"]
[null,"4. Polycyclische aromatische koolwaterstoffen (PAK's)",null,null,null,null,null,null,null,null,null,null,null,null,null,null,null,null,null,null,null,null,null,null,null,null,null,null,null,null,null,null,null,null,null,null,null,null,null,null,null,null,null,null,null,null,null,null,null,null,null,null,null,null,null,null,null,null,null,null,null,null,null,null,null,null,null,null,null,{"$f":"B26","v":"4. Polycyclische aromatische koolwaterstoffen (PAK's)"}]
[null,{"$f":"Bodemkwaliteit!F35","v":"naftaleen"},null,null,{"$f":"IF(AND(Bodemkwaliteit!H35=\"<\",Bodemkwaliteit!J35=\"<\"),\"<d\",Bodemkwaliteit!Q35)","v":"<d"},{"$f":"IF(E27=\"<d\",\"<d\",E27*$G$5)","v":"<d"},{"$f":"IF(E27=\"<d\",J27,F27*(BN27+BO27*25+BP27*10)/(BN27+$M$10*BO27+BP27*(IF($M$11<10,10,$M$11))))","v":0.05},null,0,{"$f":"IF(BE27<K27,BE27,K27)","v":0.05},{"$f":"IF(Bodemkwaliteit!BJ35=\"\",\"-\",Bodemkwaliteit!BJ35)","v":"-"},0,"","","","","","x","",null,null,"","","",{"$f":"IF(Bodemkwaliteit!BK35=\"\",\"-\",Bodemkwaliteit!BK35)","v":"-"},"",0,{"$f":"K27","v":"-"},{"$f":"IF(G27>AB27,\"> kkA\",\"\")","v":""},0,"-",{"$f":"IF(G27>AE27,\"> kkB\",\"\")","v":""},0,{"$f":"IF(Bodemkwaliteit!BL35=\"\",\"-\",Bodemkwaliteit!BL35)","v":"-"},{"$f":"IF(G27>AH27,\"> bfk industrie\",\"\")","v":""},0,{"$f":"IF(AND(AE27=\"-\",AH27=\"-\"),\"-\",MIN(AE27,AH27))","v":"-"},"",0,{"$f":"IF(Bodemkwaliteit!BO35=\"\",\"-\",Bodemkwaliteit!BO35)","v":"-"},{"$f":"IF(AN27=\"\",\"\",IF(G27>AN27,\"> i-waarde\",\"\"))","v":""},0,"-",{"$f":"IF(OR(E27=\"<d\",AQ27=\"-\"),\"\",IF(E27>AQ27,\"> CCT\",\"\"))","v":""},"",0,{"$f":"IF(AX27=\"\",\"\",IF(AX27=\"ja\",\"\",IF(AS27=\"> 1,5*CCT\",1,0)))","v":""},{"$f":"IF(AND(AT27=1,AU27=0),1,0)","v":0},null,"ja",null,null,null,null,null,0,{"$f":"IF(AND(Bodemkwaliteit!AF35=1,Bodemkwaliteit!AG35=1),MAX(BH27,IF($G$5=1,BF27,BG27)),IF($G$5=1,BF27,BG27))","v":0.05},{"$f":"Bodemkwaliteit!BE35","v":0.05},{"$f":"Bodemkwaliteit!BF35","v":2E-3},{"$f":"Bodemkwaliteit!BG35","v":5.0000000000000001E-3},{"$f":"Bodemkwaliteit!BH35","v":0.01},null,{"$f":"IF(ISNONTEXT(BF27)=TRUE,1,0)","v":1},1,1,{"$f":"Bodemkwaliteit!BS35","v":0},{"$f":"Bodemkwaliteit!BT35","v":0},{"$f":"Bodemkwaliteit!BU35","v":1},null,"naftaleen"]
[null,{"$f":"Bodemkwaliteit!F36","v":"fenantreen"},null,null,{"$f":"IF(AND(Bodemkwaliteit!H36=\"<\",Bodemkwaliteit!J36=\"<\"),\"<d\",Bodemkwaliteit!Q36)","v":"<d"},"<d",0.05,null,0,0.05,{"$f":"IF(Bodemkwaliteit!BJ36=\"\",\"-\",Bodemkwaliteit!BJ36)","v":"-"},0,"","","","","","x","",null,null,"","","",{"$f":"IF(Bodemkwaliteit!BK36=\"\",\"-\",Bodemkwaliteit!BK36)","v":"-"},"",0,"-","",0,"-","",0,{"$f":"IF(Bodemkwaliteit!BL36=\"\",\"-\",Bodemkwaliteit!BL36)","v":"-"},"",0,"-","",0,{"$f":"IF(Bodemkwaliteit!BO36=\"\",\"-\",Bodemkwaliteit!BO36)","v":"-"},"",0,"-","","",0,"",0,null,"ja",null,null,null,null,null,0,{"$f":"IF(AND(Bodemkwaliteit!AF36=1,Bodemkwaliteit!AG36=1),MAX(BH28,IF($G$5=1,BF28,BG28)),IF($G$5=1,BF28,BG28))","v":0.05},{"$f":"Bodemkwaliteit!BE36","v":0.05},{"$f":"Bodemkwaliteit!BF36","v":3.0000000000000001E-3},{"$f":"Bodemkwaliteit!BG36","v":0.01},{"$f":"Bodemkwaliteit!BH36","v":0.01},null,1,1,1,{"$f":"Bodemkwaliteit!BS36","v":0},{"$f":"Bodemkwaliteit!BT36","v":0},{"$f":"Bodemkwaliteit!BU36","v":1},null,"fenantreen"]
[null,{"$f":"Bodemkwaliteit!F37","v":"antraceen"},null,null,{"$f":"IF(AND(Bodemkwaliteit!H37=\"<\",Bodemkwaliteit!J37=\"<\"),\"<d\",Bodemkwaliteit!Q37)","v":"<d"},"<d",0.05,null,0,0.05,{"$f":"IF(Bodemkwaliteit!BJ37=\"\",\"-\",Bodemkwaliteit!BJ37)","v":"-"},0,"","","","","","x","",null,null,"","","",{"$f":"IF(Bodemkwaliteit!BK37=\"\",\"-\",Bodemkwaliteit!BK37)","v":"-"},"",0,"-","",0,"-","",0,{"$f":"IF(Bodemkwaliteit!BL37=\"\",\"-\",Bodemkwaliteit!BL37)","v":"-"},"",0,"-","",0,{"$f":"IF(Bodemkwaliteit!BO37=\"\",\"-\",Bodemkwaliteit!BO37)","v":"-"},"",0,"-","","",0,"",0,null,"ja",null,null,null,null,null,0,{"$f":"IF(AND(Bodemkwaliteit!AF37=1,Bodemkwaliteit!AG37=1),MAX(BH29,IF($G$5=1,BF29,BG29)),IF($G$5=1,BF29,BG29))","v":0.05},{"$f":"Bodemkwaliteit!BE37","v":0.05},{"$f":"Bodemkwaliteit!BF37","v":3.0000000000000001E-3},{"$f":"Bodemkwaliteit!BG37","v":0.01},{"$f":"Bodemkwaliteit!BH37","v":0.01},null,1,1,1,{"$f":"Bodemkwaliteit!BS37","v":0},{"$f":"Bodemkwaliteit!BT37","v":0},{"$f":"Bodemkwaliteit!BU37","v":1},null,"antraceen"]
[null,{"$f":"Bodemkwaliteit!F38","v":"fluoranteen"},null,null,{"$f":"IF(AND(Bodemkwaliteit!H38=\"<\",Bodemkwaliteit!J38=\"<\"),\"<d\",Bodemkwaliteit!Q38)","v":"<d"},"<d",0.05,null,0,0.05,{"$f":"IF(Bodemkwaliteit!BJ38=\"\",\"-\",Bodemkwaliteit!BJ38)","v":"-"},0,"","","","","","x","",null,null,"","","",{"$f":"IF(Bodemkwaliteit!BK38=\"\",\"-\",Bodemkwaliteit!BK38)","v":"-"},"",0,"-","",0,"-","",0,{"$f":"IF(Bodemkwaliteit!BL38=\"\",\"-\",Bodemkwaliteit!BL38)","v":"-"},"",0,"-","",0,{"$f":"IF(Bodemkwaliteit!BO38=\"\",\"-\",Bodemkwaliteit!BO38)","v":"-"},"",0,"-","","",0,"",0,null,"ja",null,null,null,null,null,0,{"$f":"IF(AND(Bodemkwaliteit!AF38=1,Bodemkwaliteit!AG38=1),MAX(BH30,IF($G$5=1,BF30,BG30)),IF($G$5=1,BF30,BG30))","v":0.05},{"$f":"Bodemkwaliteit!BE38","v":0.05},{"$f":"Bodemkwaliteit!BF38","v":3.0000000000000001E-3},{"$f":"Bodemkwaliteit!BG38","v":0.01},{"$f":"Bodemkwaliteit!BH38","v":0.01},null,1,1,1,{"$f":"Bodemkwaliteit!BS38","v":0},{"$f":"Bodemkwaliteit!BT38","v":0},{"$f":"Bodemkwaliteit!BU38","v":1},null,"fluoranteen"]
[null,{"$f":"Bodemkwaliteit!F39","v":"chryseen"},null,null,{"$f":"IF(AND(Bodemkwaliteit!H39=\"<\",Bodemkwaliteit!J39=\"<\"),\"<d\",Bodemkwaliteit!Q39)","v":"<d"},"<d",0.05,null,0,0.05,{"$f":"IF(Bodemkwaliteit!BJ39=\"\",\"-\",Bodemkwaliteit!BJ39)","v":"-"},0,"","","","","","x","",null,null,"","","",{"$f":"IF(Bodemkwaliteit!BK39=\"\",\"-\",Bodemkwaliteit!BK39)","v":"-"},"",0,"-","",0,"-","",0,{"$f":"IF(Bodemkwaliteit!BL39=\"\",\"-\",Bodemkwaliteit!BL39)","v":"-"},"",0,"-","",0,{"$f":"IF(Bodemkwaliteit!BO39=\"\",\"-\",Bodemkwaliteit!BO39)","v":"-"},"",0,"-","","",0,"",0,null,"ja",null,null,null,null,null,0,{"$f":"IF(AND(Bodemkwaliteit!AF39=1,Bodemkwaliteit!AG39=1),MAX(BH31,IF($G$5=1,BF31,BG31)),IF($G$5=1,BF31,BG31))","v":0.05},{"$f":"Bodemkwaliteit!BE39","v":0.05},{"$f":"Bodemkwaliteit!BF39","v":3.0000000000000001E-3},{"$f":"Bodemkwaliteit!BG39","v":0.01},{"$f":"Bodemkwaliteit!BH39","v":0.01},null,1,1,1,{"$f":"Bodemkwaliteit!BS39","v":0},{"$f":"Bodemkwaliteit!BT39","v":0},{"$f":"Bodemkwaliteit!BU39","v":1},null,"chryseen"]
[null,{"$f":"Bodemkwaliteit!F40","v":"benzo(a)antraceen"},null,null,{"$f":"IF(AND(Bodemkwaliteit!H40=\"<\",Bodemkwaliteit!J40=\"<\"),\"<d\",Bodemkwaliteit!Q40)","v":"<d"},"<d",0.05,null,0,0.05,{"$f":"IF(Bodemkwaliteit!BJ40=\"\",\"-\",Bodemkwaliteit!BJ40)","v":"-"},0,"","","","","","x","",null,null,"","","",{"$f":"IF(Bodemkwaliteit!BK40=\"\",\"-\",Bodemkwaliteit!BK40)","v":"-"},"",0,"-","",0,"-","",0,{"$f":"IF(Bodemkwaliteit!BL40=\"\",\"-\",Bodemkwaliteit!BL40)","v":"-"},"",0,"-","",0,{"$f":"IF(Bodemkwaliteit!BO40=\"\",\"-\",Bodemkwaliteit!BO40)","v":"-"},"",0,"-","","",0,"",0,null,"ja",null,null,null,null,null,0,{"$f":"IF(AND(Bodemkwaliteit!AF40=1,Bodemkwaliteit!AG40=1),MAX(BH32,IF($G$5=1,BF32,BG32)),IF($G$5=1,BF32,BG32))","v":0.05},{"$f":"Bodemkwaliteit!BE40","v":0.05},{"$f":"Bodemkwaliteit!BF40","v":3.0000000000000001E-3},{"$f":"Bodemkwaliteit!BG40","v":0.01},{"$f":"Bodemkwaliteit!BH40","v":0.01},null,1,1,1,{"$f":"Bodemkwaliteit!BS40","v":0},{"$f":"Bodemkwaliteit!BT40","v":0},{"$f":"Bodemkwaliteit!BU40","v":1},null,"benzo(a)antraceen"]
[null,{"$f":"Bodemkwaliteit!F41","v":"benzo(a)pyreen"},null,null,{"$f":"IF(AND(Bodemkwaliteit!H41=\"<\",Bodemkwaliteit!J41=\"<\"),\"<d\",Bodemkwaliteit!Q41)","v":"<d"},"<d",0.05,null,0,0.05,{"$f":"IF(Bodemkwaliteit!BJ41=\"\",\"-\",Bodemkwaliteit!BJ41)","v":"-"},0,"","","","","","x","",null,null,"","","",{"$f":"IF(Bodemkwaliteit!BK41=\"\",\"-\",Bodemkwaliteit!BK41)","v":"-"},"",0,"-","",0,"-","",0,{"$f":"IF(Bodemkwaliteit!BL41=\"\",\"-\",Bodemkwaliteit!BL41)","v":"-"},"",0,"-","",0,{"$f":"IF(Bodemkwaliteit!BO41=\"\",\"-\",Bodemkwaliteit!BO41)","v":"-"},"",0,"-","","",0,"",0,null,"ja",null,null,null,null,null,0,{"$f":"IF(AND(Bodemkwaliteit!AF41=1,Bodemkwaliteit!AG41=1),MAX(BH33,IF($G$5=1,BF33,BG33)),IF($G$5=1,BF33,BG33))","v":0.05},{"$f":"Bodemkwaliteit!BE41","v":0.05},{"$f":"Bodemkwaliteit!BF41","v":3.0000000000000001E-3},{"$f":"Bodemkwaliteit!BG41","v":0.01},{"$f":"Bodemkwaliteit!BH41","v":0.01},null,1,1,1,{"$f":"Bodemkwaliteit!BS41","v":0},{"$f":"Bodemkwaliteit!BT41","v":0},{"$f":"Bodemkwaliteit!BU41","v":1},null,"benzo(a)pyreen"]
[null,{"$f":"Bodemkwaliteit!F42","v":"benzo(k)fluoranteen"},null,null,{"$f":"IF(AND(Bodemkwaliteit!H42=\"<\",Bodemkwaliteit!J42=\"<\"),\"<d\",Bodemkwaliteit!Q42)","v":"<d"},"<d",0.05,null,0,0.05,{"$f":"IF(Bodemkwaliteit!BJ42=\"\",\"-\",Bodemkwaliteit!BJ42)","v":"-"},0,"","","","","","x","",null,null,"","","",{"$f":"IF(Bodemkwaliteit!BK42=\"\",\"-\",Bodemkwaliteit!BK42)","v":"-"},"",0,"-","",0,"-","",0,{"$f":"IF(Bodemkwaliteit!BL42=\"\",\"-\",Bodemkwaliteit!BL42)","v":"-"},"",0,"-","",0,{"$f":"IF(Bodemkwaliteit!BO42=\"\",\"-\",Bodemkwaliteit!BO42)","v":"-"},"",0,"-","","",0,"",0,null,"ja",null,null,null,null,null,0,{"$f":"IF(AND(Bodemkwaliteit!AF42=1,Bodemkwaliteit!AG42=1),MAX(BH34,IF($G$5=1,BF34,BG34)),IF($G$5=1,BF34,BG34))","v":0.05},{"$f":"Bodemkwaliteit!BE42","v":0.05},{"$f":"Bodemkwaliteit!BF42","v":3.0000000000000001E-3},{"$f":"Bodemkwaliteit!BG42","v":0.01},{"$f":"Bodemkwaliteit!BH42","v":0.01},null,1,1,1,{"$f":"Bodemkwaliteit!BS42","v":0},{"$f":"Bodemkwaliteit!BT42","v":0},{"$f":"Bodemkwaliteit!BU42","v":1},null,"benzo(k)fluoranteen"]
[null,{"$f":"Bodemkwaliteit!F43","v":"indeno(1,2,3-cd)pyreen"},null,null,{"$f":"IF(AND(Bodemkwaliteit!H43=\"<\",Bodemkwaliteit!J43=\"<\"),\"<d\",Bodemkwaliteit!Q43)","v":"<d"},"<d",0.05,null,0,0.05,{"$f":"IF(Bodemkwaliteit!BJ43=\"\",\"-\",Bodemkwaliteit!BJ43)","v":"-"},0,"","","","","","x","",null,null,"","","",{"$f":"IF(Bodemkwaliteit!BK43=\"\",\"-\",Bodemkwaliteit!BK43)","v":"-"},"",0,"-","",0,"-","",0,{"$f":"IF(Bodemkwaliteit!BL43=\"\",\"-\",Bodemkwaliteit!BL43)","v":"-"},"",0,"-","",0,{"$f":"IF(Bodemkwaliteit!BO43=\"\",\"-\",Bodemkwaliteit!BO43)","v":"-"},"",0,"-","","",0,"",0,null,"ja",null,null,null,null,null,0,{"$f":"IF(AND(Bodemkwaliteit!AF43=1,Bodemkwaliteit!AG43=1),MAX(BH35,IF($G$5=1,BF35,BG35)),IF($G$5=1,BF35,BG35))","v":0.05},{"$f":"Bodemkwaliteit!BE43","v":0.05},{"$f":"Bodemkwaliteit!BF43","v":3.0000000000000001E-3},{"$f":"Bodemkwaliteit!BG43","v":0.01},{"$f":"Bodemkwaliteit!BH43","v":0.01},null,1,1,1,{"$f":"Bodemkwaliteit!BS43","v":0},{"$f":"Bodemkwaliteit!BT43","v":0},{"$f":"Bodemkwaliteit!BU43","v":1},null,"indeno(1,2,3-cd)pyreen"]
[null,{"$f":"Bodemkwaliteit!F44","v":"benzo(ghi)peryleen"},null,null,{"$f":"IF(AND(Bodemkwaliteit!H44=\"<\",Bodemkwaliteit!J44=\"<\"),\"<d\",Bodemkwaliteit!Q44)","v":"<d"},"<d",0.05,null,0,0.05,{"$f":"IF(Bodemkwaliteit!BJ44=\"\",\"-\",Bodemkwaliteit!BJ44)","v":"-"},0,"","","","","","x","",null,null,"","","",{"$f":"IF(Bodemkwaliteit!BK44=\"\",\"-\",Bodemkwaliteit!BK44)","v":"-"},"",0,"-","",0,"-","",0,{"$f":"IF(Bodemkwaliteit!BL44=\"\",\"-\",Bodemkwaliteit!BL44)","v":"-"},"",0,"-","",0,{"$f":"IF(Bodemkwaliteit!BO44=\"\",\"-\",Bodemkwaliteit!BO44)","v":"-"},"",0,"-","","",0,"",0,null,"ja",null,null,null,null,null,0,{"$f":"IF(AND(Bodemkwaliteit!AF44=1,Bodemkwaliteit!AG44=1),MAX(BH36,IF($G$5=1,BF36,BG36)),IF($G$5=1,BF36,BG36))","v":0.05},{"$f":"Bodemkwaliteit!BE44","v":0.05},{"$f":"Bodemkwaliteit!BF44","v":3.0000000000000001E-3},{"$f":"Bodemkwaliteit!BG44","v":0.01},{"$f":"Bodemkwaliteit!BH44","v":0.01},null,1,1,1,{"$f":"Bodemkwaliteit!BS44","v":0},{"$f":"Bodemkwaliteit!BT44","v":0},{"$f":"Bodemkwaliteit!BU44","v":1},null,"benzo(ghi)peryleen"]
[null,{"$f":"Bodemkwaliteit!F45","v":"PAK's (10 VROM) (0,7 factor)"},"H=",{"$f":"(IF($M$11<10,10,$M$11))","v":10},{"$f":"IF(AND(Bodemkwaliteit!H45=\"<\",Bodemkwaliteit!J45=\"<\"),\"<d\",Bodemkwaliteit!Q45)","v":"<d"},"<d",{"$f":"IF(E37=\"<d\",J37,F37*(BN37+BO37*25+BP37*10)/(BN37+$M$10*BO37+D37*BP37))","v":0.5},null,1,0.5,{"$f":"IF(Bodemkwaliteit!BJ45=\"\",\"-\",Bodemkwaliteit!BJ45)","v":1.5},1,"",0,0,0,0,{"$f":"IF(L56=0,\"x\",\"-\")","v":"x"},"",null,null,"","","",{"$f":"IF(Bodemkwaliteit!BK45=\"\",\"-\",Bodemkwaliteit!BK45)","v":6.8},"",0,9,"",0,40,"",0,{"$f":"IF(Bodemkwaliteit!BL45=\"\",\"-\",Bodemkwaliteit!BL45)","v":40},"",0,40,"",0,{"$f":"IF(Bodemkwaliteit!BO45=\"\",\"-\",Bodemkwaliteit!BO45)","v":40},"",0,8,"","",0,"",0,null,"ja",null,1,null,null,null,1,{"$f":"IF(AND(Bodemkwaliteit!AF45=1,Bodemkwaliteit!AG45=1),MAX(BH37,IF($G$5=1,BF37,BG37)),IF($G$5=1,BF37,BG37))","v":0.5},{"$f":"Bodemkwaliteit!BE45","v":0.5},{"$f":"Bodemkwaliteit!BF45","v":2.1000000000000001E-2},{"$f":"Bodemkwaliteit!BG45","v":0.1},{"$f":"Bodemkwaliteit!BH45","v":0},null,1,1,1,{"$f":"Bodemkwaliteit!BS45","v":0},{"$f":"Bodemkwaliteit!BT45","v":0},{"$f":"Bodemkwaliteit!BU45","v":1},null,"PAK's (10 VROM) (0,7 factor)"]
[null,"5. Gechloreerde koolwaterstoffen",null,null,null,null,null,null,null,null,null,null,null,null,null,null,null,null,null,null,null,null,null,null,null,null,null,null,null,null,null,null,null,null,null,null,null,null,null,null,null,null,null,null,null,null,null,null,null,null,null,null,null,null,null,null,null,null,null,null,null,null,null,null,null,null,null,null,null,"5. Gechloreerde koolwaterstoffen"]
[null,{"$f":"Bodemkwaliteit!F47","v":"d. polichloorbifenylen (PCB's)"},null,null,null,null,null,null,null,null,null,null,null,null,null,null,null,null,null,null,null,null,null,null,null,null,null,null,null,null,null,null,null,null,null,null,null,null,null,null,null,null,null,null,null,null,null,null,null,null,null,null,null,null,null,null,null,null,null,null,null,null,null,null,null,null,null,null,null,"d. polichloorbifenylen (PCB's)"]
[null,{"$f":"Bodemkwaliteit!F48","v":"S.v.p. keuze voor toetsing PCB's opgeven (mg/kg=0 ; ug/kg=1):"},null,{"$f":"IF(Bodemkwaliteit!J48=1,\"ug/kg\",IF(Bodemkwaliteit!J48=0,\"mg/kg\",\"fout\"))","v":"mg/kg"},null,null,null,null,null,null,null,null,null,null,null,null,null,null,null,null,null,null,null,null,null,null,null,null,null,null,null,null,null,null,null,null,null,null,null,null,null,null,null,null,null,null,null,null,null,null,null,null,null,null,null,null,null,null,null,null,null,null,null,null,null,null,null,null,null,"S.v.p. keuze voor toetsing PCB's opgeven (mg/kg=0 ; ug/kg=1):"]
[null,{"$f":"Bodemkwaliteit!F49","v":"PCB 28"},null,null,{"$f":"IF(AND(Bodemkwaliteit!H49=\"<\",Bodemkwaliteit!J49=\"<\"),\"<d\",Bodemkwaliteit!Q49)","v":"<d"},{"$f":"IF(E41=\"<d\",\"<d\",E41*$G$5)","v":"<d"},{"$f":"IF(E41=\"<d\",J41,F41*(BN41+BO41*25+BP41*10)/(BN41+$M$10*BO41+BP41*$M$11))","v":1E-3},null,{"$f":"IF(AND(G41>0,L41=1),1,0)","v":0},{"$f":"IF(BE41<K41,BE41,K41)","v":1E-3},{"$f":"IF(Bodemkwaliteit!BJ49=\"\",\"-\",Bodemkwaliteit!BJ49)","v":"-"},{"$f":"IF(K41=\"-\",0,1)","v":0},{"$f":"IF(G41>K41,\"> agw\",\"\")","v":""},{"$f":"IF(K41=\"-\",\"\",IF(M41=\"> agw\",1,0))","v":""},{"$f":"IF(K41=\"-\",\"\",IF(AND(G41>K41,G41<2*K41,G41<Y41,G41<AE41),1,0))","v":""},{"$f":"IF(K41=\"-\",\"\",IF(AND(N41=1,O41=1),1,0))","v":""},{"$f":"IF(K41=\"-\",\"\",IF(AND(N41=1,O41=0),1,0))","v":""},"x",{"$f":"IF(M41=\"\",\"\",IF(AND(M41=\"> agw\",R41=\"x\"),\"ber. msPAF\",IF(R41=\"-\",\"\",IF(G41>R41,\"nee\",\"ja\"))))","v":""},null,null,{"$f":"IF(S41=\"\",\"\",IF(S41=\"ja\",1,0))","v":""},{"$f":"IF(S41=\"\",\"\",IF(S41=\"nee\",1,0))","v":""},{"$f":"IF(S41=\"\",\"\",IF(OR(S41=\"ber. msPAF\",S41=\"ja, ber. msPAF\"),1,0))","v":""},{"$f":"IF(Bodemkwaliteit!BK49=\"\",\"-\",Bodemkwaliteit!BK49)","v":"-"},{"$f":"IF(G41>Y41,\"> bkk w\",\"\")","v":""},{"$f":"IF(Z41=\"> bkk w\",1,0)","v":0},{"$f":"IF(D40=\"ug/kg\",1000*0.014,IF(D40=\"mg/kg\",0.014,\"fout\"))","v":1.4E-2},{"$f":"IF(G41>AB41,\"> kkA\",\"\")","v":""},{"$f":"IF(AC41=\"> kkA\",1,0)","v":0},"-",{"$f":"IF(G41>AE41,\"> kkB\",\"\")","v":""},{"$f":"IF(AF41=\"> kkB\",1,0)","v":0},{"$f":"IF(Bodemkwaliteit!BL49=\"\",\"-\",Bodemkwaliteit!BL49)","v":"-"},{"$f":"IF(G41>AH41,\"> bfk industrie\",\"\")","v":""},{"$f":"IF(AI41=\"> bfk industrie\",1,0)","v":0},{"$f":"IF(AND(AE41=\"-\",AH41=\"-\"),\"-\",MIN(AE41,AH41))","v":"-"},{"$f":"IF(G41>AK41,\"> min\",\"\")","v":""},{"$f":"IF(AL41=\"> min\",1,0)","v":0},{"$f":"IF(Bodemkwaliteit!BO49=\"\",\"-\",Bodemkwaliteit!BO49)","v":"-"},{"$f":"IF(AN41=\"\",\"\",IF(G41>AN41,\"> i-waarde\",\"\"))","v":""},{"$f":"IF(AO41=\"> i-waarde\",1,0)","v":0},"-",{"$f":"IF(OR(E41=\"<d\",AQ41=\"-\"),\"\",IF(E41>AQ41,\"> CCT\",\"\"))","v":""},{"$f":"IF(AQ41=\"-\",\"\",IF(G41>1.5*AQ41,\"> 1,5*CCT\",\"\"))","v":""},{"$f":"IF(AR41=\"> CCT\",1,0)","v":0},{"$f":"IF(AX41=\"\",\"\",IF(AX41=\"ja\",\"\",IF(AS41=\"> 1,5*CCT\",1,0)))","v":""},{"$f":"IF(AND(AT41=1,AU41=0),1,0)","v":0},null,"ja",null,1,null,null,null,{"$f":"L41","v":0},{"$f":"IF(AND(Bodemkwaliteit!AF49=1,Bodemkwaliteit!AG49=1),MAX(BH41,IF($G$5=1,BF41,BG41)),IF($G$5=1,BF41,BG41))","v":1E-3},{"$f":"Bodemkwaliteit!BE49","v":1E-3},{"$f":"Bodemkwaliteit!BF49","v":0},{"$f":"Bodemkwaliteit!BG49","v":0.01},{"$f":"Bodemkwaliteit!BH49","v":1.4E-2},null,{"$f":"IF(ISNONTEXT(BF41)=TRUE,1,0)","v":1},1,{"$f":"IF(ISNONTEXT(BJ41)=TRUE,1,0)","v":1},{"$f":"Bodemkwaliteit!BS49","v":0},{"$f":"Bodemkwaliteit!BT49","v":0},{"$f":"Bodemkwaliteit!BU49","v":1},null,"PCB 28"]
[null,{"$f":"Bodemkwaliteit!F50","v":"PCB 52"},null,null,{"$f":"IF(AND(Bodemkwaliteit!H50=\"<\",Bodemkwaliteit!J50=\"<\"),\"<d\",Bodemkwaliteit!Q50)","v":"<d"},"<d",1E-3,null,0,1E-3,{"$f":"IF(Bodemkwaliteit!BJ50=\"\",\"-\",Bodemkwaliteit!BJ50)","v":"-"},0,"","","","","","x","",null,null,"","","",{"$f":"IF(Bodemkwaliteit!BK50=\"\",\"-\",Bodemkwaliteit!BK50)","v":"-"},"",0,{"$f":"IF(D40=\"ug/kg\",1000*0.015,IF(D40=\"mg/kg\",0.015,\"fout\"))","v":1.4999999999999999E-2},"",0,"-","",0,{"$f":"IF(Bodemkwaliteit!BL50=\"\",\"-\",Bodemkwaliteit!BL50)","v":"-"},"",0,"-","",0,{"$f":"IF(Bodemkwaliteit!BO50=\"\",\"-\",Bodemkwaliteit!BO50)","v":"-"},"",0,"-","","",0,"",0,null,"ja",null,1,null,null,null,0,{"$f":"IF(AND(Bodemkwaliteit!AF50=1,Bodemkwaliteit!AG50=1),MAX(BH42,IF($G$5=1,BF42,BG42)),IF($G$5=1,BF42,BG42))","v":1E-3},{"$f":"Bodemkwaliteit!BE50","v":1E-3},{"$f":"Bodemkwaliteit!BF50","v":0},{"$f":"Bodemkwaliteit!BG50","v":0.01},{"$f":"Bodemkwaliteit!BH50","v":1.4E-2},null,1,1,1,{"$f":"Bodemkwaliteit!BS50","v":0},{"$f":"Bodemkwaliteit!BT50","v":0},{"$f":"Bodemkwaliteit!BU50","v":1},null,"PCB 52"]
[null,{"$f":"Bodemkwaliteit!F51","v":"PCB 101"},null,null,{"$f":"IF(AND(Bodemkwaliteit!H51=\"<\",Bodemkwaliteit!J51=\"<\"),\"<d\",Bodemkwaliteit!Q51)","v":"<d"},"<d",1E-3,null,0,1E-3,{"$f":"IF(Bodemkwaliteit!BJ51=\"\",\"-\",Bodemkwaliteit!BJ51)","v":"-"},0,"","","","","","x","",null,null,"","","",{"$f":"IF(Bodemkwaliteit!BK51=\"\",\"-\",Bodemkwaliteit!BK51)","v":"-"},"",0,{"$f":"IF(D40=\"ug/kg\",1000*0.023,IF(D40=\"mg/kg\",0.023,\"fout\"))","v":2.3E-2},"",0,"-","",0,{"$f":"IF(Bodemkwaliteit!BL51=\"\",\"-\",Bodemkwaliteit!BL51)","v":"-"},"",0,"-","",0,{"$f":"IF(Bodemkwaliteit!BO51=\"\",\"-\",Bodemkwaliteit!BO51)","v":"-"},"",0,"-","","",0,"",0,null,"ja",null,1,null,null,null,0,{"$f":"IF(AND(Bodemkwaliteit!AF51=1,Bodemkwaliteit!AG51=1),MAX(BH43,IF($G$5=1,BF43,BG43)),IF($G$5=1,BF43,BG43))","v":1E-3},{"$f":"Bodemkwaliteit!BE51","v":1E-3},{"$f":"Bodemkwaliteit!BF51","v":0},{"$f":"Bodemkwaliteit!BG51","v":0.01},{"$f":"Bodemkwaliteit!BH51","v":1.4E-2},null,1,1,1,{"$f":"Bodemkwaliteit!BS51","v":0},{"$f":"Bodemkwaliteit!BT51","v":0},{"$f":"Bodemkwaliteit!BU51","v":1},null,"PCB 101"]
[null,{"$f":"Bodemkwaliteit!F52","v":"PCB 118"},null,null,{"$f":"IF(AND(Bodemkwaliteit!H52=\"<\",Bodemkwaliteit!J52=\"<\"),\"<d\",Bodemkwaliteit!Q52)","v":"<d"},"<d",1E-3,null,0,1E-3,{"$f":"IF(Bodemkwaliteit!BJ52=\"\",\"-\",Bodemkwaliteit!BJ52)","v":"-"},0,"","","","","","x","",null,null,"","","",{"$f":"IF(Bodemkwaliteit!BK52=\"\",\"-\",Bodemkwaliteit!BK52)","v":"-"},"",0,{"$f":"IF(D40=\"ug/kg\",1000*0.016,IF(D40=\"mg/kg\",0.016,\"fout\"))","v":1.6E-2},"",0,"-","",0,{"$f":"IF(Bodemkwaliteit!BL52=\"\",\"-\",Bodemkwaliteit!BL52)","v":"-"},"",0,"-","",0,{"$f":"IF(Bodemkwaliteit!BO52=\"\",\"-\",Bodemkwaliteit!BO52)","v":"-"},"",0,"-","","",0,"",0,null,"ja",null,1,null,null,null,0,{"$f":"IF(AND(Bodemkwaliteit!AF52=1,Bodemkwaliteit!AG52=1),MAX(BH44,IF($G$5=1,BF44,BG44)),IF($G$5=1,BF44,BG44))","v":1E-3},{"$f":"Bodemkwaliteit!BE52","v":1E-3},{"$f":"Bodemkwaliteit!BF52","v":0},{"$f":"Bodemkwaliteit!BG52","v":0.01},{"$f":"Bodemkwaliteit!BH52","v":1.4E-2},null,1,1,1,{"$f":"Bodemkwaliteit!BS52","v":0},{"$f":"Bodemkwaliteit!BT52","v":0},{"$f":"Bodemkwaliteit!BU52","v":1},null,{"$f":"#REF!","v":{"$error":"#REF!"}}]
[null,{"$f":"Bodemkwaliteit!F53","v":"PCB  138"},null,null,{"$f":"IF(AND(Bodemkwaliteit!H53=\"<\",Bodemkwaliteit!J53=\"<\"),\"<d\",Bodemkwaliteit!Q53)","v":"<d"},"<d",1E-3,null,0,1E-3,{"$f":"IF(Bodemkwaliteit!BJ53=\"\",\"-\",Bodemkwaliteit!BJ53)","v":"-"},0,"","","","","","x","",null,null,"","","",{"$f":"IF(Bodemkwaliteit!BK53=\"\",\"-\",Bodemkwaliteit!BK53)","v":"-"},"",0,{"$f":"IF(D40=\"ug/kg\",1000*0.027,IF(D40=\"mg/kg\",0.027,\"fout\"))","v":2.7E-2},"",0,"-","",0,{"$f":"IF(Bodemkwaliteit!BL53=\"\",\"-\",Bodemkwaliteit!BL53)","v":"-"},"",0,"-","",0,{"$f":"IF(Bodemkwaliteit!BO53=\"\",\"-\",Bodemkwaliteit!BO53)","v":"-"},"",0,"-","","",0,"",0,null,"ja",null,1,null,null,null,0,{"$f":"IF(AND(Bodemkwaliteit!AF53=1,Bodemkwaliteit!AG53=1),MAX(BH45,IF($G$5=1,BF45,BG45)),IF($G$5=1,BF45,BG45))","v":1E-3},{"$f":"Bodemkwaliteit!BE53","v":1E-3},{"$f":"Bodemkwaliteit!BF53","v":0},{"$f":"Bodemkwaliteit!BG53","v":0.01},{"$f":"Bodemkwaliteit!BH53","v":1.4E-2},null,1,1,1,{"$f":"Bodemkwaliteit!BS53","v":0},{"$f":"Bodemkwaliteit!BT53","v":0},{"$f":"Bodemkwaliteit!BU53","v":1},null,{"$f":"B44","v":"PCB 118"}]
[null,{"$f":"Bodemkwaliteit!F54","v":"PCB 153"},null,null,{"$f":"IF(AND(Bodemkwaliteit!H54=\"<\",Bodemkwaliteit!J54=\"<\"),\"<d\",Bodemkwaliteit!Q54)","v":"<d"},"<d",1E-3,null,0,1E-3,{"$f":"IF(Bodemkwaliteit!BJ54=\"\",\"-\",Bodemkwaliteit!BJ54)","v":"-"},0,"","","","","","x","",null,null,"","","",{"$f":"IF(Bodemkwaliteit!BK54=\"\",\"-\",Bodemkwaliteit!BK54)","v":"-"},"",0,{"$f":"IF(D40=\"ug/kg\",1000*0.033,IF(D40=\"mg/kg\",0.033,\"fout\"))","v":3.3000000000000002E-2},"",0,"-","",0,{"$f":"IF(Bodemkwaliteit!BL54=\"\",\"-\",Bodemkwaliteit!BL54)","v":"-"},"",0,"-","",0,{"$f":"IF(Bodemkwaliteit!BO54=\"\",\"-\",Bodemkwaliteit!BO54)","v":"-"},"",0,"-","","",0,"",0,null,"ja",null,1,null,null,null,0,{"$f":"IF(AND(Bodemkwaliteit!AF54=1,Bodemkwaliteit!AG54=1),MAX(BH46,IF($G$5=1,BF46,BG46)),IF($G$5=1,BF46,BG46))","v":1E-3},{"$f":"Bodemkwaliteit!BE54","v":1E-3},{"$f":"Bodemkwaliteit!BF54","v":0},{"$f":"Bodemkwaliteit!BG54","v":0.01},{"$f":"Bodemkwaliteit!BH54","v":1.4E-2},null,1,1,1,{"$f":"Bodemkwaliteit!BS54","v":0},{"$f":"Bodemkwaliteit!BT54","v":0},{"$f":"Bodemkwaliteit!BU54","v":1},null,{"$f":"B45","v":"PCB  138"}]
[null,{"$f":"Bodemkwaliteit!F55","v":"PCB 180"},null,null,{"$f":"IF(AND(Bodemkwaliteit!H55=\"<\",Bodemkwaliteit!J55=\"<\"),\"<d\",Bodemkwaliteit!Q55)","v":"<d"},"<d",1E-3,null,0,1E-3,{"$f":"IF(Bodemkwaliteit!BJ55=\"\",\"-\",Bodemkwaliteit!BJ55)","v":"-"},0,"","","","","","x","",null,null,"","","",{"$f":"IF(Bodemkwaliteit!BK55=\"\",\"-\",Bodemkwaliteit!BK55)","v":"-"},"",0,{"$f":"IF(D40=\"ug/kg\",1000*0.018,IF(D40=\"mg/kg\",0.018,\"fout\"))","v":1.7999999999999999E-2},"",0,"-","",0,{"$f":"IF(Bodemkwaliteit!BL55=\"\",\"-\",Bodemkwaliteit!BL55)","v":"-"},"",0,"-","",0,{"$f":"IF(Bodemkwaliteit!BO55=\"\",\"-\",Bodemkwaliteit!BO55)","v":"-"},"",0,"-","","",0,"",0,null,"ja",null,1,null,null,null,0,{"$f":"IF(AND(Bodemkwaliteit!AF55=1,Bodemkwaliteit!AG55=1),MAX(BH47,IF($G$5=1,BF47,BG47)),IF($G$5=1,BF47,BG47))","v":1E-3},{"$f":"Bodemkwaliteit!BE55","v":1E-3},{"$f":"Bodemkwaliteit!BF55","v":0},{"$f":"Bodemkwaliteit!BG55","v":0.01},{"$f":"Bodemkwaliteit!BH55","v":1.4E-2},null,1,1,1,{"$f":"Bodemkwaliteit!BS55","v":0},{"$f":"Bodemkwaliteit!BT55","v":0},{"$f":"Bodemkwaliteit!BU55","v":1},null,{"$f":"B46","v":"PCB 153"}]
[null,{"$f":"Bodemkwaliteit!F56","v":"PCB's (som 7) (0,7 factor)"},null,null,{"$f":"IF(AND(Bodemkwaliteit!H56=\"<\",Bodemkwaliteit!J56=\"<\"),\"<d\",Bodemkwaliteit!Q56)","v":"<d"},"<d",7.0000000000000001E-3,null,1,7.0000000000000001E-3,{"$f":"IF(Bodemkwaliteit!BJ56=\"\",\"-\",Bodemkwaliteit!BJ56)","v":0.02},1,"",0,0,0,0,{"$f":"IF(L56=0,\"x\",\"-\")","v":"x"},"",null,null,"","","",{"$f":"IF(Bodemkwaliteit!BK56=\"\",\"-\",Bodemkwaliteit!BK56)","v":0.04},"",0,{"$f":"IF(D40=\"ug/kg\",1000*0.139,IF(D40=\"mg/kg\",0.139,\"fout\"))","v":0.13900000000000001},"",0,{"$f":"IF(D40=\"ug/kg\",1000*1,IF(D40=\"mg/kg\",1,\"fout\"))","v":1},"",0,{"$f":"IF(Bodemkwaliteit!BL56=\"\",\"-\",Bodemkwaliteit!BL56)","v":0.5},"",0,0.5,"",0,{"$f":"IF(Bodemkwaliteit!BO56=\"\",\"-\",Bodemkwaliteit!BO56)","v":1},"",0,{"$f":"IF(D40=\"ug/kg\",1000*0.1,IF(D40=\"mg/kg\",0.1,\"fout\"))","v":0.1},"","",0,"",0,null,"ja",null,1,1,null,null,1,{"$f":"IF(AND(Bodemkwaliteit!AF56=1,Bodemkwaliteit!AG56=1),MAX(BH48,IF($G$5=1,BF48,BG48)),IF($G$5=1,BF48,BG48))","v":7.0000000000000001E-3},{"$f":"Bodemkwaliteit!BE56","v":7.0000000000000001E-3},{"$f":"Bodemkwaliteit!BF56","v":0},{"$f":"Bodemkwaliteit!BG56","v":0.01},{"$f":"Bodemkwaliteit!BH56","v":1.4E-2},null,1,1,1,{"$f":"Bodemkwaliteit!BS56","v":0},{"$f":"Bodemkwaliteit!BT56","v":0},{"$f":"Bodemkwaliteit!BU56","v":1},null,"PCB's (som 7) (0,7 factor)"]
[null,"Overige stoffen",null,null,null,null,null,null,null,null,null,null,null,null,null,null,null,null,null,null,null,null,null,null,null,null,null,null,null,null,null,null,null,null,null,null,null,null,null,null,null,null,null,null,null,null,null,null,null,null,null,null,null,null,null,null,null,null,null,null,null,null,null,null,null,null,null,null,null,{"$f":"B49","v":"Overige stoffen"}]
[null,{"$f":"Bodemkwaliteit!F58","v":"minerale olie"},null,null,{"$f":"IF(AND(Bodemkwaliteit!H58=\"<\",Bodemkwaliteit!J58=\"<\"),\"<d\",Bodemkwaliteit!Q58)","v":"<d"},{"$f":"IF(E50=\"<d\",\"<d\",E50*$G$5)","v":"<d"},{"$f":"IF(E50=\"<d\",J50,F50*(BN50+BO50*25+BP50*10)/(BN50+$M$10*BO50+BP50*$M$11))","v":35},null,1,{"$f":"IF(BE50<K50,BE50,K50)","v":35},{"$f":"IF(Bodemkwaliteit!BJ58=\"\",\"-\",Bodemkwaliteit!BJ58)","v":190},{"$f":"IF(K50=\"-\",0,1)","v":1},"",{"$f":"IF(K50=\"-\",\"\",IF(M50=\"> agw\",1,0))","v":0},0,{"$f":"IF(K50=\"-\",\"\",IF(AND(N50=1,O50=1),1,0))","v":0},0,3000,{"$f":"IF(M50=\"\",\"\",IF(AND(M50=\"> agw\",R50=\"x\"),\"ber. msPAF\",IF(R50=\"-\",\"\",IF(G50>R50,\"nee\",\"ja\"))))","v":""},null,{"$f":"IF(G50<R50,1,0)","v":1},"","","",{"$f":"IF(Bodemkwaliteit!BK58=\"\",\"-\",Bodemkwaliteit!BK58)","v":190},{"$f":"IF(G50>Y50,\"> bkk w\",\"\")","v":""},{"$f":"IF(Z50=\"> bkk w\",1,0)","v":0},1250,{"$f":"IF(G50>AB50,\"> kkA\",\"\")","v":""},{"$f":"IF(AC50=\"> kkA\",1,0)","v":0},5000,{"$f":"IF(G50>AE50,\"> kkB\",\"\")","v":""},{"$f":"IF(AF50=\"> kkB\",1,0)","v":0},{"$f":"IF(Bodemkwaliteit!BL58=\"\",\"-\",Bodemkwaliteit!BL58)","v":500},{"$f":"IF(G50>AH50,\"> bfk industrie\",\"\")","v":""},{"$f":"IF(AI50=\"> bfk industrie\",1,0)","v":0},{"$f":"IF(AND(AE50=\"-\",AH50=\"-\"),\"-\",MIN(AE50,AH50))","v":500},{"$f":"IF(G50>AK50,\"> min\",\"\")","v":""},{"$f":"IF(AL50=\"> min\",1,0)","v":0},{"$f":"IF(Bodemkwaliteit!BO58=\"\",\"-\",Bodemkwaliteit!BO58)","v":5000},{"$f":"IF(AN50=\"\",\"\",IF(G50>AN50,\"> i-waarde\",\"\"))","v":""},{"$f":"IF(AO50=\"> i-waarde\",1,0)","v":0},1250,{"$f":"IF(OR(E50=\"<d\",AQ50=\"-\"),\"\",IF(E50>AQ50,\"> CCT\",\"\"))","v":""},"",0,{"$f":"IF(AX50=\"\",\"\",IF(AX50=\"ja\",\"\",IF(AS50=\"> 1,5*CCT\",1,0)))","v":""},{"$f":"IF(AND(AT50=1,AU50=0),1,0)","v":0},null,"ja",null,1,null,null,null,1,{"$f":"IF(AND(Bodemkwaliteit!AF58=1,Bodemkwaliteit!AG58=1),MAX(BH50,IF($G$5=1,BF50,BG50)),IF($G$5=1,BF50,BG50))","v":35},{"$f":"Bodemkwaliteit!BE58","v":35},{"$f":"Bodemkwaliteit!BF58","v":17},{"$f":"Bodemkwaliteit!BG58","v":20},{"$f":"Bodemkwaliteit!BH58","v":20},null,1,1,1,{"$f":"Bodemkwaliteit!BS58","v":0},{"$f":"Bodemkwaliteit!BT58","v":0},{"$f":"Bodemkwaliteit!BU58","v":1},null,"minerale olie"]
[null,null,null,null,null,null,null,null,null,null,null,null,null,"A >agw","A voldoet art. 4.2.2.-4 en -5\nx>agw en x<2*agw en <bkk w en <kk A","A voldoet","A voldoet niet","aantal x","aantal msPAF",null,null,null,null,null,null,null,null,null,null,null,null,null,null,null,null,null,null,null,null,null,null,null,null,null,null,null,null,null,null,null,null,null,null,null,null,null,null,{"$f":"Bodemkwaliteit!BE60","v":0},{"$f":"Bodemkwaliteit!BF60","v":0},{"$f":"Bodemkwaliteit!BG60","v":0},{"$f":"Bodemkwaliteit!BH60","v":0},null,null,null,null,null,null,null,null,0]
[null,null,null,null,null,null,null,null,{"$f":"SUM(I17:I50)","v":12},null,null,{"$f":"SUM(L17:L50)","v":12},null,{"$f":"SUM(N17:N50)","v":0},{"$f":"SUM(O17:O50)","v":0},{"$f":"SUM(P17:P50)","v":0},{"$f":"SUM(Q17:Q50)","v":0},{"$f":"COUNTIF(R17:R50,R15)","v":27},{"$f":"COUNTIF(S17:S50,S15)","v":0},{"$f":"SUM(T17:T50)","v":1},{"$f":"SUM(U17:U50)","v":1},{"$f":"SUM(V17:V50)","v":0},{"$f":"SUM(W17:W50)","v":0},{"$f":"SUM(X17:X50)","v":0},null,null,{"$f":"SUM(AA17:AA50)","v":0},null,null,{"$f":"SUM(AD17:AD50)","v":0},null,null,{"$f":"SUM(AG17:AG50)","v":0},null,null,{"$f":"SUM(AJ17:AJ50)","v":0},null,null,{"$f":"SUM(AM17:AM50)","v":0},null,null,{"$f":"SUM(AP17:AP50)","v":0},null,{"$f":"COUNTIF(AR17:AR50,AR13)","v":0},null,{"$f":"SUM(AT17:AT50)","v":0},{"$f":"SUM(AU17:AU50)","v":0},{"$f":"SUM(AV17:AV50)","v":0},null,null,null,{"$f":"SUM(AZ17:AZ50)","v":19},{"$f":"SUM(BA17:BA50)","v":1},null,null,{"$f":"SUM(BD17:BD50)","v":12}]
[null,null,null,null,null,null,null,null,null,null,null,null,null,null,null,null,null,null,"verschil"]
[null,null,null,null,null,null,null,null,null,null,null,null,null,null,{"$f":"IF(AND(N52>0,I52>=37,O52<=5,(N52-P52=0)),1,0)","v":0},null,null,null,{"$f":"R52-S52","v":27},null,null,null,null,{"$f":"IF(AND(O59=0,W52>0),\"mag niet\",IF(AND(W52=0,X52>0),\"mag: ber msPAF\",IF(OR(AND(X52=0,T52=1),AND(X52=0,U52=1),AND(X52=0,T52=1,U52=1)),\"mag\",\"\")))","v":"mag"},null,null,{"$f":"IF(AA52>0,\"mag niet\",\"mag\")","v":"mag"},null,null,{"$f":"IF(AND(O59=0,AD52>0),\"mag niet\",\"mag\")","v":"mag"},null,null,{"$f":"IF(AG52>0,\"mag niet\",\"mag\")","v":"mag"},null,null,{"$f":"IF(AJ52>0,\"mag niet\",\"mag\")","v":"mag"},null,null,{"$f":"IF(AM52>0,\"mag niet\",\"mag\")","v":"mag"},null,null,{"$f":"IF(AP52>0,\"mag niet\",\"mag\")","v":"mag"},null,null,null,null,null,{"$f":"IF(AND(AV52<=2,AU52=0,(AT52-AV52=0)),\"mag\",\"mag niet\")","v":"mag"}]
[null,null,null,null,null,null,null,null,null,null,null,null,null,null,{"$f":"IF(AND(N52>0,I52>=27,O52<=4,(N52-P52=0)),1,0)","v":0}]
[null,null,null,null,null,null,null,null,null,null,"N,T-Aw2000:",{"$f":"IF(Bodemkwaliteit!G72=\"N,T-AW2000\",1,0)","v":0},null,null,{"$f":"IF(AND(N52>0,I52>=16,O52<=3,(N52-P52=0)),1,0)","v":0}]
[null,null,null,null,null,null,null,null,null,null,null,null,null,null,{"$f":"IF(AND(N52>0,I52>=7,O52<=2,(N52-P52=0)),1,0)","v":0}]
[null,null,null,null,null,null,null,null,null,null,null,null,null,null,{"$f":"IF(AND(N52>0,I52>=2,O52<=1,(N52-P52=0)),1,0)","v":0}]
[null,null,null,null,null,null,null,null,null,null,null,null,null,null,{"$f":"MAX(O54:O58)","v":0}]
[]
[null,"Voor verspreiden baggerspecie over het aangrenzende perceel:",null,null,null,null,null,null,null,null,null,null,null,null,null,null,null,null,null,null,null,null,null,null,null,null,null,null,null,null,null,null,null,null,null,null,null,{"$f":"IF(N52=0,1,0)","v":1},{"$f":"IF(AND(N52>0,OR(X54=\"mag\",X54=\"mag: ber msPAF\")),2,0)","v":0},{"$f":"IF(AND(N52>0,O59=0,X54=\"mag\"),3,0)","v":0},{"$f":"IF(AND(N52>=1,X54=\"mag: ber msPAF\",AP54=\"mag\"),4,0)","v":0},{"$f":"IF(AND(X54=\"mag niet\",AP54=\"mag\"),5,0)","v":0},{"$f":"IF(AP54=\"mag niet\",6,0)","v":0},{"$f":"MAX(AL61:AQ61)","v":1}]
[null,{"$f":"IF(AR61=6,\"nooit verspreiden/toepassen\",IF(AR61=5,\"niet verspreiden\",IF(AR61=4,\"verspreidbaar op aangrenzend perceel mits msPAF voldoet\",IF(AR61=3,\"verspreidbaar op aangrenzend perceel\",IF(AR61=2,\"vrij toepasbaar (voldoet aan Rbk, art 4.2.2-4 [N,T-toets])\",IF(OR(AR61=1,AR61=0),\"vrij toepasbaar\",\"fout\"))))))","v":"vrij toepasbaar"}]
[]
[null,"NB: de msPAF-grens voor verspreiding op aangrenzend perceel is: msPAF-metalen <50% en msPAF-organisch < 20% en minerale olie < 3000 en cadmium < 7,5.",null,null,null,null,null,null,null,null,null,null,null,null,null,null,null,null,null,null,null,null,null,null,null,null,null,null,null,null,null,null,null,null,null,null,"Te berekenen met het programma OMEGA 6.1"]
[]
[]
[null,"Voor verspreiden van baggerspecie in oppervlaktewater:",null,null,null,null,null,null,null,null,null,null,null,null,null,null,null,null,null,null,null,null,null,null,null,null,null,null,null,null,null,null,null,null,null,null,null,null,{"$f":"IF(N52=0,1,0)","v":1},{"$f":"IF(O59=1,2,0)","v":0},{"$f":"IF(AND(N52>0,O59=0,AD54=\"mag\",OR(X54=\"mag\",X54=\"mag: ber msPAF\"),AG54=\"mag\"),3,0)","v":0},{"$f":"IF(AND(AD54=\"mag niet\",AG54=\"mag\"),4,0)","v":0},{"$f":"IF(AG54=\"mag niet\",5,0)","v":0},{"$f":"MAX(AM67:AQ67)","v":1}]
[null,{"$f":"IF(AR67=5,\"nooit verspreiden/toepassen\",IF(AR67=4,\"niet verspreidbaar\",IF(AR67=3,\"verspreidbaar in zoet water\",IF(AR67=2,\"vrij toepasbaar (voldoet aan Rbk, 4.2.2-4 [N,T-toets])\",IF(OR(AR67=1,AR67=0),\"vrij toepasbaar\",\"fout\")))))","v":"vrij toepasbaar"}]
[]
[]
[null,"Voor toepassen van baggerspecie in oppervlaktewater :",null,null,null,null,null,null,null,null,null,null,null,null,null,null,null,null,null,null,null,null,null,null,null,null,null,null,null,null,null,null,null,null,null,null,null,null,{"$f":"IF(N52=0,1,0)","v":1},{"$f":"IF(O59=1,2,0)","v":0},{"$f":"IF(AND(N52>0,O59=0,AD54=\"mag\",IF(Y72=0,AG54=\"mag\",AM54=\"mag\")),3,0)","v":0},{"$f":"IF(AND(AD54=\"mag niet\",IF(Y72=0,AG54=\"mag\",AM54=\"mag\")),4,0)","v":0},{"$f":"IF(IF(Y72=0,AG54=\"mag niet\",AM54=\"mag niet\"),5,0)","v":0},{"$f":"MAX(AM71:AQ71)","v":1}]
[null,"Is de bodem niet afkomstig van de bodem onder het oppevlaktewater?",null,null,null,null,null,null,null,null,null,null,null,null,null,null,null,null,null,null,null,null,null,null,0,"(1=ja [afkomstig droge bodem];0=nee [afkomstig waterbodem])"]
[null,{"$f":"IF(AR71=5,\"nooit verspreiden/toepassen\",IF(AR71=4,\"toepasbaar bodemkwaliteitsklasse B\",IF(AR71=3,\"toepasbaar bodemkwaliteitsklasse A\",IF(AR71=2,\"vrij toepasbaar (voldoet aan Rbk, 4.2.2-4 [N,T-toets])\",IF(OR(AR71=1,AR71=0),\"vrij toepasbaar\",\"fout\")))))","v":"vrij toepasbaar"}]
[]
[]
[null,"Voor verspreiden van baggerspecie in zout oppervlaktewater:",null,null,null,null,null,null,null,null,null,null,null,null,null,null,null,null,null,null,null,null,null,null,null,null,null,null,null,null,null,null,null,null,null,null,null,null,{"$f":"IF(N52=0,1,0)","v":1},{"$f":"IF(O59=1,2,0)","v":0},{"$f":"IF(AND(N52>0,O59=0,AV54=\"mag\"),3,0)","v":0},{"$f":"IF(AV54=\"mag niet\",4,0)","v":0},null,{"$f":"MAX(AM76:AQ76)","v":1}]
[null,{"$f":"IF(AR76=4,\"nooit verspreiden/toepassen\",IF(AR76=3,\"verspreidbaar in zeewater\",IF(AR76=2,\"vrij toepasbaar (voldoet aan Rbk, art. 4.2.2-4 [N,T-toets])\",IF(OR(AR76=1,AR76=0),\"vrij toepasbaar\",\"fout\"))))","v":"vrij toepasbaar"}]
[null,null,null,null,null,null,null,null,null,null,null,null,null,null,null,null,null,null,null,null,null,null,null,null,null,null,null,null,null,null,null,null,null,null,null,null,null,null,null,null,null,null,null,null,null,null,null,null,null,null,null,null,null,"cyanide","vinylchl"]
[null,{"$f":"IF(BB79=0,\"\",IF(#REF!=\"> agw\",\"Bij overschrijding van de agw voor cyanide-vrij moet cyanide in de bodemlucht worden gemetem en getoetst aan de )Toxicologisch Toelaatbare Concentratie in lucht.\",\"\"))","v":""},null,null,null,null,null,null,null,null,null,null,null,null,null,null,null,null,null,null,null,null,null,null,null,null,null,null,null,null,null,null,null,null,null,null,null,null,null,null,null,null,null,null,null,null,null,null,null,null,null,null,null,{"$f":"SUM(BB17:BB50)","v":0}]
[null,{"$f":"IF(BC80=0,\"\",IF(#REF!=\"> agw\",\"Bij waarden van vynilchloride boven de bepalingsgrens (0,1) moet het grondwater worden onderzocht.\",\"\"))","v":""},null,null,null,null,null,null,null,null,null,null,null,null,null,null,null,null,null,null,null,null,null,null,null,null,null,null,null,null,null,null,null,null,null,null,null,null,null,null,null,null,null,null,null,null,null,null,null,null,null,null,null,null,{"$f":"SUM(BC17:BC50)","v":0}]
[null,"Kwaliteitscontrole van de hierboven gesteld conclusie:"]
[]
[null,"Naam toetser:",null,null,null,null,null,null,null,null,"Paraaf:",null,null,null,null,null,null,null,null,null,null,null,null,null,"Datum:",null,null,null,"Naam 2e lezer:",null,null,null,null,null,"Paraaf:",null,null,null,null,"Datum:"]

{"sheet":"Toepassingseis","index":5,"n_rows":50,"n_cols":26,"rows_kept":50,"cut":false,"hidden":false,"merged":[[45,1,45,3],[45,5,45,15],[1,3,1,6],[2,3,2,6],[1,7,1,15],[2,7,2,15]]}
[]
[null,"Projectcode: ",null,{"$f":"Bodemkwaliteit!H3","v":"< code >"},null,null,null,{"$f":"Bodemkwaliteit!L3","v":"Partij < partijnaam >"}]
[null,"Datum toetsing:",null,{"$f":"Bodemkwaliteit!H4","v":"<datum>"},null,null,null,{"$f":"IF(Bodemkwaliteit!L4=\"\",\"\",Bodemkwaliteit!L4)","v":"< meldnummer >"}]
[]
[null,"Bepaling van de generieke toepassingseis voor de onderzocht partij grond:"]
[]
[]
[null,"De soort toepassing"]
[null,"Betreft het een toepassing conform Bbk, art 35, onder"]
[null,"a.","van grond of baggerspecie in bouw- en wegconstructies w.o. grondwallen?",null,null,null,null,null,null,null,0,"(1=ja;0=nee)"]
[null,"b.","van grond of baggerspecie op of in de droge bodem in ophogingen?",null,null,null,null,null,null,null,1,"(1=ja;0=nee)"]
[null,"c.","van grond of baggerspecie in leeflagen?",null,null,null,null,null,null,null,0,"(1=ja;0=nee)"]
[null,"d.","van grond of baggerspecie t.b.v. verondiepingen en dempingen opp.water?",null,null,null,null,null,null,null,0,"(1=ja;0=nee)"]
[null,"e.","van grond of baggerspecie in aanvullingen of t.b.v. onderhoud en herstel a. t/m d.?",null,null,null,null,null,null,null,0,"(1=ja;0=nee)"]
[null,"f.","van baggerspecie t.b.v. verspreiding uit een watergang op het aangrenzende perceel?",null,null,null,null,null,null,null,0,"(1=ja;0=nee)"]
[null,"g.","van baggerspecie t.b.v. verspreiding in het oppervlaktewater?",null,null,null,null,null,null,null,0,"(1=ja;0=nee)"]
[null,"h.","van grond of baggerspecie in tijdelijke opslag bestemd voor a. t/m e.?",null,null,null,null,null,null,null,0,"(1=ja;0=nee)"]
[null,null,"op de droge of natte bodem?",null,null,null,1,"(droog=1; nat=2)"]
[null,null,"voor de duur van maximaal?",null,null,null,1,{"$f":"IF(G18=1,\"(<6 maanden=1; 6 mnd - 3 jaar=2; langer=3)\",IF(G18=2,\"(6 maanden =1; 10 jaar=2; langer=3)\",\"\"))","v":"(<6 maanden=1; 6 mnd - 3 jaar=2; langer=3)"},null,null,null,null,null,null,null,null,null,null,{"$f":"IF(OR(AND(K17=1,G19=1),AND(I21=1,G21=1)),1,0)","v":0}]
[null,"i.","van bagger in tijdelijke opslag bestemd voor a. t/m f. op het naastgelegen perceel?",null,null,null,null,null,null,null,0,"(1=ja;0=nee)",null,null,null,null,null,null,{"$f":"SUM(K10:K17)+K20+K23","v":1},{"$f":"IF(OR(S20=0,S20>1),1,0)","v":0}]
[null,null,"op de droge of natte bodem?",null,null,null,2,"(droog=1; nat=2)",null,null,null,null,null,null,null,null,null,null,{"$f":"IF(OR(AND(K17=1,G19=3),AND(K20=1,G22=3)),1,0)","v":0},{"$f":"IF(OR(AND(K17=1,G19=2),AND(K20=1,G22=2)),1,0)","v":0}]
[null,null,"voor de duur van maximaal?",null,null,null,2,{"$f":"IF(G21=1,\"(<6 maanden=1; 6mnd - 3 jaar=2; langer=3)\",IF(G21=2,\"(<6 maanden =1; 6 mnd - 10 jaar=2; langer=3)\",\"\"))","v":"(<6 maanden =1; 6 mnd - 10 jaar=2; langer=3)"}]
[null,"Betreft het een toepassing op een GBT conform Bbk, art. 63?",null,null,null,null,null,null,null,null,0,"(1=ja;0=nee)",null,null,null,null,null,null,{"$f":"IF(Bodemkwaliteit!F76=\"\",0,IF(Bodemkwaliteit!F76=\"Let op: voor grootschalige toepassing uitloging uitvoeren en emissie bepalen!\",1,2))","v":0},{"$f":"IF(AND(S23=0,K23=1),1,0)","v":0},{"$f":"IF(AND(S23=1,K23=1),1,0)","v":0}]
[null,null,{"$f":"IF(AND(K23=1,S23=1),\"Is er een uitloogproef L/S=10 uitgevoerd?\",\"\")","v":""},null,null,null,0,"(1=ja;0=nee)",null,null,null,null,null,null,null,null,null,null,{"$f":"IF(C24=\"Is er een uitloogproef L/S=10 uitgevoerd?\",1,0)","v":0}]
[null,null,"Voldoet de emissie?",null,null,null,0,"(1=ja;0=nee)",null,null,null,null,null,null,null,null,null,null,{"$f":"IF(C26=\"Voldoen de minimale eisen Bbk, art. 63 GBT?\",1,0)","v":1}]
[null,null,"Voldoen de minimale eisen Bbk, art. 63 GBT?",null,null,null,{"$f":"IF(OR(AND('Grootschalige toepassing'!F8=1,'Grootschalige toepassing'!F9=1,'Grootschalige toepassing'!F10=0),AND('Grootschalige toepassing'!F13=1,'Grootschalige toepassing'!F14=1)),1,0)","v":1},"(1=ja;0=nee)",null,null,null,null,null,null,null,null,null,null,{"$f":"IF(AND(K23=1,G24=1,G25=1,G26=1),1,0)","v":0}]
[]
[null,"Functionaliteit, nuttigheid, hoeveelheid toepassing."]
[null,"Betreft het een toepassing die voldoet aan Bbk, art. 5?",null,null,null,null,null,null,null,1,"(1=ja;0=nee)"]
[]
[null,"BKK"]
[null,"Heeft de gemeente waar de toepassingslocatie is een bodemfunctieklassenkaart?",null,null,null,null,null,null,null,0,"(1=ja;0=nee)"]
[null,null,null,null,null,null,null,null,null,2,{"$f":"IF(J32=0,\"\",IF(OR(J31=1,J32=1),\"(0=niet bekend; 1=AW2000; 2=wonen; 3=industrie)\",\"\"))","v":""},null,null,null,null,{"$f":"IF(J32=0,\"AW2000\",IF(AND(J32=1,J33=1),\"AW2000\",IF(AND(J32=1,J33=2),\"wonen\",IF(AND(J32=1,J33=3),\"industrie\",\"\"))))","v":"AW2000"},null,null,{"$f":"IF(J32=0,1,J33)","v":1}]
[null,{"$f":"IF(J32=1,\"Heeft de gemeente waar de toepassingslocatie is een bodemkwaliteitklassenkaart?\",\"\")","v":""},null,null,null,null,null,null,null,0,{"$f":"IF(J32=1,\"(1=ja;0=nee)\",\"\")","v":""}]
[null,{"$f":"IF(AND(J32=1,J34=0),\"Is de bodemkwaliteit ter plekke vastgesteld conform Rbk, art. 4.3.4-1?\",\"\")","v":""},null,null,null,null,null,null,null,0,{"$f":"IF(AND(J32=1,J34=0),\"(1=ja;0=nee)\",\"\")","v":""}]
[null,{"$f":"IF(J32=0,\"\",IF(OR(J34=1,J35=1),\"Wat is de kwaliteitklasse ter plekke?\",\"\"))","v":""},null,null,null,null,null,null,null,1,{"$f":"IF(J32=0,\"\",IF(OR(J34=1,J35=1),\"(0=niet bekend; 1=AW2000; 2=wonen; 3=industrie)\",\"\"))","v":""},null,null,null,null,{"$f":"IF(AND(J32=1,OR(J34=1,J35=1),J36=1),\"AW2000\",IF(AND(J32=1,OR(J34=1,J35=1),J36=2),\"wonen\",IF(AND(J32=1,OR(J34=1,J35=1),J36=3),\"industrie\",\"\")))","v":""},null,null,{"$f":"IF(OR(J32=0,AND(J34=0,J35=0)),1,J36)","v":1},null,{"$f":"MIN(S33:S36)","v":1}]
[]
[null,"Toepassingseis"]
[null,"De toepassingseis conform de BKK:",null,null,null,{"$f":"IF(U36=1,\"AW2000\",IF(U36=2,\"wonen\",IF(U36=3,\"industrie\",\"\")))","v":"AW2000"}]
[]
[null,"Toepassing mogelijk / niet mogelijk?"]
[null,"Kwaliteit van de toe te passen grond:",null,null,null,{"$f":"IF(AND(Bodemkwaliteit!L71=\"Let op: Deze kwaliteit is beter dan voor samenvoeging\",Bodemkwaliteit!H7=1),Bodemkwaliteit!BE8,IF(OR(Bodemkwaliteit!AY71=1,Bodemkwaliteit!AX71=1,Bodemkwaliteit!AX72=5),\"niet toepasbaar\",IF(OR(Bodemkwaliteit!AY71=2,Bodemkwaliteit!AX72=1),\"industrie\",IF(Bodemkwaliteit!AX72=2,\"wonen\",IF(OR(Bodemkwaliteit!AX72=3,Bodemkwaliteit!AX72=4),\"AW2000\",\"\")))))","v":"AW2000"},null,null,{"$f":"IF(AND(K23=1,G24=1,G25=1),\"die voldoet aan de emissie toetswaarden\",\"\")","v":""},null,null,null,null,null,null,null,null,null,{"$f":"IF(F42=\"AW2000\",1,IF(F42=\"wonen\",2,IF(F42=\"industrie\",3,IF(F42=\"niet toepasbaar\",\"4\",0))))","v":1}]
[]
[null,"Toepassingseis:",null,null,null,{"$f":"IF(U36=1,\"AW2000\",IF(U36=2,\"wonen\",IF(U36=3,\"industrie\",\"niet bekend\")))","v":"AW2000"},null,null,null,null,null,null,null,null,null,null,null,null,{"$f":"IF(F44=\"AW2000\",1,IF(F44=\"wonen\",2,IF(F44=\"industrie\",3,IF(F44=\"niet bekend\",4,0))))","v":1}]
[null,null,null,null,null,null,null,null,null,null,null,null,null,null,null,null,null,null,null,null,null,null,null,{"$f":"IF(AND(S42<=S44,S44=1),1,0)","v":1}]
[null,"Voor de toepassing geldt:",null,null,null,{"$f":"IF(T20=1,\"invoerkeuze a. t/m i. en GBT beperken tot 1 mogelijkheid\",IF(OR(T23=1,AND(SUM(K10:K17)+K20=0,S26=1,J29=1)),\"De partij kan in de GBT toegepast worden (mits voldaan wordt aan de eisen Bbk, art. 63).\",IF(OR(S21=1,S42=4,AND(K23=1,S26=0,SUM(K10:K17)+K20=0),J29=0,AND(X45=0,X46=0,X47=0),OR(G19=2,G19=3)),\"De toepassing is niet mogelijk\",IF(S19=1,\"Bij tijdelijke opslag tot 6 maanden geen toepassingseis\",IF(X45=1,\"De toepassing is mogelijk\",IF(X46=1,\"De toepassing is mogelijk\",IF(X47=1,\"De toepassing is mogelijk\",\"\")))))))","v":"De toepassing is mogelijk"},null,null,null,null,null,null,null,null,null,null,null,null,{"$f":"MIN(S42:S44)","v":1},{"$f":"IF(F46=\"Bij tijdelijke opslag tot 6 maanden geen toepassingseis\",1,IF(F46=\"invoerkeuze a. t/m i. en GBT beperken tot 1 mogelijkheid\",2,IF(F46=\"de toepassing is niet mogelijk\",3,IF(F46=\"AW2000\",4,IF(F46=\"wonen\",5,IF(F46=\"industrie\",6,IF(F46=\"De partij kan in de GBT toegepast worden (mits voldaan wordt aan de eisen bbk, art. 63).\",7,0)))))))","v":0},{"$f":"IF(AND(S21=0,OR(J32=0,S46=1)),1,0)","v":1},null,null,{"$f":"IF(AND(S42<=S44, S44=2),1,0)","v":0}]
[null,{"$f":"IF(T46=7,\"Kwaliteit van de leeflaag moet zijn:\",\"\")","v":""},null,null,null,{"$f":"IF(T46=7,V47,\"\")","v":""},null,null,null,null,null,null,null,null,null,null,null,null,null,null,null,{"$f":"IF(U46=1,\"AW2000\",IF(S46=2,\"wonen\",IF(AND(S46=3,K23=1),\"industrie\",IF(OR(S21=3,S42=4,S26=0),\"de toepassing is niet mogelijk\",\"\"))))","v":"AW2000"},null,{"$f":"IF(AND(S42<=S44,S44=3,K23=0),1,0)","v":0},null,{"$f":"IF(T20=1,\"invoerkeuze a. t/m i. en GBT beperken tot 1 mogelijkheid\",\"invoerkeuze aantal is o.k.\")","v":"invoerkeuze aantal is o.k."}]
[null,null,null,null,null,{"$f":"IF(K23=1,Bodemkwaliteit!F76,\"\")","v":""},null,null,null,null,null,null,null,null,null,null,null,null,null,null,null,null,null,null,null,{"$f":"IF(OR(T23=1,AND(SUM(K10+K17)+K20=0,S26=1,J29=1)),\"De partij kan in de GBT toegepast worden (mits voldaan wordt aan de eisen Bbk, art. 63).\",\"niet in GBT\")","v":"niet in GBT"}]
[null,{"$f":"IF(OR(T46=1,T46=4,T46=5,T46=6,T46=7),\"De toepassing dient ten minste 5 werkdagen voor aanvang gemeld te worden.\",\"\")","v":""},null,null,null,null,null,null,null,null,null,null,null,null,null,null,null,null,null,null,null,null,null,null,null,{"$f":"IF(OR(S21=1,S42=4,AND(K23=1,S26=0,SUM(K10:K17)+K20=0),J29=0,AND(X45=0,X46=0,X47=0),OR(G19=2,G19=3)),\"De toepassing is niet mogelijk\",\"anders\")","v":"anders"}]
[null,{"$f":"IF(T21=1,\"Tevens voor afloop van de 6 maanden melden: eindbestemming en de kwaliteit van de bodem onder de tijdelijke opslag.\",\"\")","v":""}]

{"sheet":"Partijgrootte","index":6,"n_rows":62,"n_cols":23,"rows_kept":62,"cut":false,"hidden":false,"merged":[[2,4,2,6],[1,4,1,6],[1,7,1,10],[2,7,2,10]]}
[]
[null,null,"Projectcode: ",null,{"$f":"Bodemkwaliteit!H3","v":"< code >"},null,null,{"$f":"Bodemkwaliteit!L3","v":"Partij < partijnaam >"}]
[null,null,"Datum toetsing:",null,{"$f":"Bodemkwaliteit!H4","v":"<datum>"},null,null,{"$f":"IF(Bodemkwaliteit!L4=\"\",\"\",Bodemkwaliteit!L4)","v":"< meldnummer >"}]
[null,null,"Maximale partijgrootte"]
[]
[null,null,"Eisen Regeling bodemkwaliteit"]
[null,null,"Rbk, art. 4.3.3 lid 1a: Voor een partijkeuring geldt dat de grootte van de partij maximaal 10.000 ton bedraagt",null,null,null,null,null,null,null,null,null,null,null,10000]
[null,null,"Rbk, art. 4.3.3 lid 4: In afwijking van lid 1a geldt voor de bepaling van het gehalte aan asbest "]
[null,null,"in de bodem en partijen grond overeenkomstig NEN5707 een maximale partijgrootte van 2.000 ton",null,null,null,null,null,null,null,null,null,null,null,2000]
[null,null,"Is er sprake van een partijkeuring t.b.v. het bepalen van het gehalte asbest?",null,null,null,null,null,0,"(1=ja;0=nee)"]
[null,null,null,null,null,null,null,"wordt voldaan aan art.2-b v/h productbesluit asbest?",1,"(1=ja;0=nee)",{"$f":"IF(I11=\"\",\"<- 0 of 1 invullen!\",\"\")","v":""}]
[]
[null,null,"Rbk, art. 1s en 4.3.4: het samenvoegen van partijen is een erkende werkzaamheid (BRL9335/BRL7500)."]
[null,null,"Is er sprake van een onder BRL9335/BRL7500 samengevoegde partij?",null,null,null,null,null,{"$f":"Bodemkwaliteit!H7","v":0},"(ja=1;nee=0)",null,null,null,null,"opmerking: voor onder BRL9335 samengevoegde partijen is de maximale partijgrootte 2.000 ton"]
[null,null,null,null,null,null,null,null,null,null,null,null,null,null,"Voor onder BRL9335 ingenomen niet-samengevoegde, enkelvoudige, partijen blijft de maximale partijgrootte"]
[null,null,null,null,null,null,null,null,null,null,null,null,null,null,"conform protocol 1001 maximaal 10.000 ton."]
[null,null,"Eisen protocol 1001 en NEN5740"]
[null,null,"Is er sprake van van een keuring niet-reinigbare grond voor definitieve verwijdering "]
[null,null,"(ten behoeve van het verkrijgen niet-reinigbaarheidsverklaring Bodem+)?",null,null,null,null,null,0,"(ja=1;nee=0)",null,null,null,null,{"$f":"O9","v":2000}]
[]
[null,null,"Protocol 1001, par. 6.1.2: bodem en waterbodem (in-situ) resp. grond en baggerspecie (depots - dus na ontgraving)"]
[null,null,"mogen worden aangemerkt als 1 partij (tot de maximale partijgrootte), indien voldaan wordt aan de volgende eisen:"]
[]
[null,null,"1. is er sprake van een eenduidige en gelijke textuur, bepaald overeenkomstig NEN5706?",null,null,null,null,null,null,1,"(ja=1;nee=0)"]
[null,null,"2. is er sprake van aaneengesloten percelen of depots?",null,null,null,null,null,null,1,"(ja=1;nee=0)"]
[null,null,"3. zijn de aangetroffen bijmengingen van de individuele partijen"]
[null,null,"qua samenstelling en percentage (bepaald cfrm 2001) gelijk?",null,null,null,null,null,null,1,"(ja=1;nee=0)"]
[null,null,"4. Is er sprake van een milieuhygienisch gelijke kwaliteit?",null,null,null,null,null,null,1,"(ja=1;nee=0)"]
[null,null,null,"is dit vastgesteld middels:",null,null,null,{"$f":"IF(AND(J28=1,J33=0),\"tenminste één van onderstaande positief invullen\",\"\")","v":""},null,{"$f":"IF(AND(J24=1,J25=1,J27=1,J28=1),1,0)","v":1}]
[null,null,null,"- of een indicatieve partijkeuring?",null,null,null,0,"(ja=1;nee=0)"]
[null,null,null,"- of een verkennend bodemonderzoek?",null,null,null,1,"(ja=1;nee=0)"]
[null,null,null,"- of een bodemverwachtingenkaart (waterbodem)?",null,null,null,0,"(ja=1;nee=0)"]
[null,null,null,"- of een historisch bodemonderzoek en/of BKK?",null,null,null,0,"(ja=1;nee=0)",{"$f":"IF(OR(H30=1,H31=1,H32=1,H33=1),1,0)","v":1}]
[null,null,null,null,null,"Deze kwaliteit is waarschijnlijk:",1,"(1=AW2000;2=wonen;3=industrie;4=niet-toepasbaar)"]
[]
[null,null,"Vooronderzoek",null,{"$f":"IF(I10=1,\"voor asbestverdachte partijen is vooronderzoek conform NEN5707 voorgeschreven\",\"\")","v":""}]
[null,null,"Het betreft een keuring ten behoeve van,",null,null,null,{"$f":"IF(G43=0,\"tenminste één van onderstaande positief invullen\",\"\")","v":""}]
[null,null,"keuring niet-reinigbare grond:",null,null,null,{"$f":"IF(I19=1,1,0)","v":0},"(ja=1;nee=0)",null,null,{"$f":"IF(G38=1,\"Vooronderzoek is verplicht\",\"\")","v":""}]
[null,null,"een ex-situ partij?",null,null,null,1,"(ja=1;nee=0)",null,null,{"$f":"IF(AND(G39=1,Bodemkwaliteit!H7=1),\"voorinformatie conform par. 6.2 noodzakelijk\",IF(G39=1,\"Vooronderzoek is aanbevolen\",\"\"))","v":"Vooronderzoek is aanbevolen"}]
[null,null,"een in-situ partij?",null,null,null,{"$f":"IF(G39=1,0,1)","v":0},"(ja=1;nee=0)",null,null,{"$f":"IF(G40=1,\"Vooronderzoek is verplicht\",\"\")","v":""}]
[null,null,"dieper dan 5 m-mv?",null,null,null,0,"(ja=1;nee=0)",null,null,null,null,null,null,{"$f":"O9","v":2000}]
[null,null,"onder duurzaam aaneengsloten verhardingslaag?",null,null,null,0,"(ja=1;nee=0)"]
[null,null,null,null,null,null,{"$f":"IF(OR(G39=1,G40=1,G38=1,G42=1,G41=1),1,0)","v":1}]
[null,null,{"$f":"IF(G40=1,\"bij in-stu onderzoek gelden aanvullende voorschriften:\",\"\")","v":""}]
[null,null,{"$f":"IF(G40=1,\"- vormt het ontgravingsplan de relatie tussen de af te voeren partij en de partijkeuring?\",\"\")","v":""},null,null,null,null,null,null,1,"(ja=1;nee=0)",null,null,null,{"$f":"IF(AND(J45=1,J46=0),1,0)","v":1},{"$f":"IF(AND(J45=1,J46=1,J48=0,J50=1),1,0)","v":0},{"$f":"IF(AND(J45=1,J46=1,J48=0,J50=0),1,0)","v":0},{"$f":"IF(AND(J45=1,J46=1,J48=1,J50=1),1,0)","v":0},{"$f":"IF(AND(J45=1,J46=1,J48=1,J50=0),1,0)","v":0},{"$f":"IF(AND(J45=0,J46=0),1,0)","v":0},{"$f":"IF(AND(J45=0,J46=1,J48=0,J50=0),1,0)","v":0},{"$f":"IF(AND(J45=0,J46=1,J48=0,J50=1),1,0)","v":0},{"$f":"IF(AND(J45=0,J46=1,J48=1),1,0)","v":0}]
[null,null,{"$f":"IF(G40=1,\"- komen er n.a.v. (veld)onderzoek (proefboringen) afwijkende lagen voor?\",\"\")","v":""},null,null,null,null,null,null,0,"(ja=1;nee=0)"]
[null,null,{"$f":"IF(AND(J46=1,J28=1),\"Is de milieuhygiensiche kwaliteit wel gelijk? NB: verschillende lagen dienen separaat bemonsterd te worden!\",IF(J46=1,\"Afwijkende lagen separaat bemonsteren\",\"\"))","v":""},null,null,null,null,null,null,null,null,null,null,null,"goed",{"$f":"IF(OR(O45=1,P45=1,T45=1,V45=1),1,0)","v":1}]
[null,null,null,null,null,null,null,null,"Worden verschillende lagen separaat bemonsterd?",1,"(ja=1;nee=0)",null,null,null,"goed +",{"$f":"IF(OR(R45=1,S45=1,W45=1),1,0)","v":0}]
[null,null,null,null,null,"Is op basis van v.o. vastgesteld dat de lagen eenzelfde",null,null,null,null,null,null,null,null,"niet",{"$f":"IF(OR(Q45=1,U45=1),1,0)","v":0}]
[null,null,null,null,null,null,null,null,"kwaliteit hebben (ontgravinsgplan nog niet bekend)?",0,"(ja=1;nee=0)"]
[]
[]
[null,null,"Resumé"]
[null,null,{"$f":"IF(OR(AND(J29=1,G40=0),AND(J29=1,G40=1,P47=1)),\"De partij voldoet aan de eisen voor de maximale partijgrootte van:\",IF(AND(J29=1,G40=1,P48=1),\"De partij dient opgedeeld te worden in meerdere deelpartijen.\",IF(OR(J29=0,AND(J29=1,G40=1,P49=1)),\"De partij voldoet niet aan de eisen voor de maximale partijgrootte.\",\"fout\")))","v":"De partij voldoet aan de eisen voor de maximale partijgrootte van:"},null,null,null,null,{"$f":"IF(AND(J29=1,I10=0,I14=0,I19=0,G42=0,OR(G39=1,AND(G40=1,P47=1))),O7,IF(AND(J29=1,OR(G39=1,AND(G40=1,P47=1)),OR(I10=1,I14=1,I19=1,G42=1)),O9,IF(P48=1,\"\",\"\")))","v":10000},{"$f":"IF(AND(G40=1,OR(P48=1,P49=1)),\"\",\"ton\")","v":"ton"}]
[]
[null,null,{"$f":"IF(OR(J29=0,AND(J29=1,G40=1,OR(P48=1,P49=1))),\"Welke kleinere partij voldoet wel aan de hierboven genoemde eisen?\",\"\")","v":""}]
[null,null,{"$f":"IF(OR(J29=0,AND(J29=1,G40=1,OR(P48=1,P49=1))),\"S.v.p. het tonnage invullen van die kleinere (deel)partij die wel aan de eisen voldoet:\",\"\")","v":""},null,null,null,null,null,null,0,"ton",null,null,null,{"$f":"IF(H54=\"\",J57,\"\")","v":""},null,null,null,{"$f":"IF(C57=\"S.v.p. het tonnage invullen van die kleinere (deel)partij die wel aan de eisen voldoet:\",1,0)","v":0}]
[]
[null,null,"De maximale partijgrootte bedraagt:",null,null,{"$f":"IF(AND(C54=\"De partij dient opgedeeld te worden in meerdere deelpartijen.\",S57=0),\"< < < <\",IF(AND(J29=1,S57=0),H54,IF(S57=1,J57,\"fout\")))","v":10000},"    ton (per deelpartij)"]
[]
[]
[null,null,{"$f":"IF(AND(I10=1,Bodemkwaliteit!A60=0),\"Let op bij partijkeuring asbest een toetssheet uitkiezen inclusief asbestgehalten\",\"\")","v":""}]

{"sheet":"TEQ - dioxines","index":7,"n_rows":47,"n_cols":22,"rows_kept":47,"cut":false,"hidden":false,"merged":[]}
["TEQ berekening"]
[]
["Som TEQ = sommatie van dioxineachtigen (C*TEF)",null,null,null,null,null,null,null,{"$f":"Bodemkwaliteit!CB56","v":0},null,null,null,null,null,null,null,null,{"$f":"Bodemkwaliteit!CE56","v":0}]
[null,null,null,null,null,null,null,null,{"$f":"Bodemkwaliteit!D60","v":1}]
[null,null,null,null,null,null,null,null,{"$f":"Bodemkwaliteit!D61","v":0}]
[]
["Stof","TEF",null,null,null,null,"C[M--A]   mg/kg d.s.",null,null,null,"TEQ [M--A]",null,null,null,null,"C[M--B]   mg/kg d.s.",null,null,null,"TEQ [M--A]"]
["Gechlorineerde dibenzo-p-dioxines",null,null,null,null,"n<","nanogram (10^-9)",null,"C(d)","C(d)-ng",null,null,null,null,"n<","nanogram (10^-9)",null,null,"C(d)-ng"]
["2,3,7,8-T(tetra)CDD",1,null,null,null,{"$f":"IF(G9=\"\",\"\",IF(G9=\"<\",1,0))","v":1},"<",0.78,{"$f":"IF(H9=\"\",\"\",IF(G9=\"<\",0.7*H9,H9))","v":0.54599999999999993},{"$f":"I9","v":0.54599999999999993},{"$f":"J9*B9","v":0.54599999999999993},null,null,null,{"$f":"IF(P9=\"\",\"\",IF(P9=\"<\",1,0))","v":1},"<",0.78,{"$f":"IF(Q9=\"\",\"\",IF(P9=\"<\",0.7*Q9,Q9))","v":0.54599999999999993},{"$f":"R9","v":0.54599999999999993},{"$f":"S9*B9","v":0.54599999999999993}]
["1,2,3,7,8-Pe(penta)CDD",1,null,null,null,{"$f":"IF(G10=\"\",\"\",IF(G10=\"<\",1,0))","v":1},"<",1.4,{"$f":"IF(H10=\"\",\"\",IF(G10=\"<\",0.7*H10,H10))","v":0.97999999999999987},{"$f":"I10","v":0.97999999999999987},0.97999999999999987,null,null,null,1,"<",1.4,0.97999999999999987,{"$f":"R10","v":0.97999999999999987},{"$f":"S10*B10","v":0.97999999999999987}]
["1,2,3,6,7,8-Hx(hexa)CDD",0.1,null,null,null,1,"<",2.8,1.9599999999999997,1.9599999999999997,0.19599999999999998,null,null,null,1,"<",2.8,1.9599999999999997,1.9599999999999997,0.19599999999999998]
["1,2,3,7,8,9-Hx(hexa)CDD",0.1,null,null,null,1,"<",2.8,1.9599999999999997,1.9599999999999997,0.19599999999999998,null,null,null,1,"<",2.8,1.9599999999999997,1.9599999999999997,0.19599999999999998]
["1,2,3,4,7,8-Hx(hexa)CDD",0.1,null,null,null,1,"<",2.8,1.9599999999999997,1.9599999999999997,0.19599999999999998,null,null,null,1,"<",2.8,1.9599999999999997,1.9599999999999997,0.19599999999999998]
["1,2,3,4,6,7,8-Hp(hepta)CDD",0.01,null,null,null,1,"<",2.8,1.9599999999999997,1.9599999999999997,1.9599999999999999E-2,null,null,null,1,"<",2.8,1.9599999999999997,1.9599999999999997,1.9599999999999999E-2]
["1,2,3,4,6,7,8,9-OCDD",2.9999999999999997E-4,null,null,null,1,"<",2.8,1.9599999999999997,1.9599999999999997,5.8799999999999987E-4,null,null,null,1,"<",2.8,1.9599999999999997,1.9599999999999997,5.8799999999999987E-4]
["Gechlorineerde dibenzofuranen",null,null,null,null,"",null,null,null,null,null,null,null,null,"",null,null,null,null,0]
["2,3,7,8-T(tetra)CDF",0.1,null,null,null,1,"<",0.98,0.68599999999999994,{"$f":"I17","v":0.68599999999999994},{"$f":"J17*B17","v":6.8599999999999994E-2},null,null,null,1,"<",0.98,0.68599999999999994,{"$f":"R17","v":0.68599999999999994},6.8599999999999994E-2]
["1,2,3,7,8-Pe(penta)CDF",0.03,null,null,null,1,"<",0.98,0.68599999999999994,0.68599999999999994,2.0579999999999998E-2,null,null,null,1,"<",0.98,0.68599999999999994,0.68599999999999994,2.0579999999999998E-2]
["1,2,4,7,8-Pe(penta)CDF",0.3,null,null,null,1,"<",2.2999999999999998,1.6099999999999999,1.6099999999999999,0.48299999999999993,null,null,null,1,"<",2.2999999999999998,1.6099999999999999,1.6099999999999999,0.48299999999999993]
["1,2,3,6,7,8-Hx(hexa)CDF",0.1,null,null,null,1,"<",2.2999999999999998,1.6099999999999999,1.6099999999999999,0.161,null,null,null,1,"<",2.2999999999999998,1.6099999999999999,1.6099999999999999,0.161]
["1,2,3,7,8,9-Hx(hexa)CDF",0.1,null,null,null,1,"<",2.2999999999999998,1.6099999999999999,1.6099999999999999,0.161,null,null,null,1,"<",2.2999999999999998,1.6099999999999999,1.6099999999999999,0.161]
["1,2,3,4,7,8-Hx(hexa)CDF",0.1,null,null,null,1,"<",2.2999999999999998,1.6099999999999999,1.6099999999999999,0.161,null,null,null,1,"<",2.2999999999999998,1.6099999999999999,1.6099999999999999,0.161]
["1,2,4,6,7,8-Hx(hexa)CDF",0.1,null,null,null,1,"<",2.2999999999999998,1.6099999999999999,1.6099999999999999,0.161,null,null,null,1,"<",2.2999999999999998,1.6099999999999999,1.6099999999999999,0.161]
["1,2,3,4,6,7,8-Hp(hepta)CDF",0.01,null,null,null,1,"<",4.9000000000000004,3.43,3.43,3.4300000000000004E-2,null,null,null,1,"<",4.9000000000000004,3.43,3.43,3.4300000000000004E-2]
["1,2,3,4,7,8,9-Hp(hepta)CDF",0.01,null,null,null,1,"<",4.9000000000000004,3.43,3.43,3.4300000000000004E-2,null,null,null,1,"<",4.9000000000000004,3.43,3.43,3.4300000000000004E-2]
["1,2,3,4,6,7,8,9-OCDF",2.9999999999999997E-4,null,null,null,1,"<",4.9000000000000004,3.43,3.43,1.029E-3,null,null,null,1,"<",4.9000000000000004,3.43,3.43,1.029E-3]
["PCB's",null,null,null,null,null,{"$f":"IF(Bodemkwaliteit!J48=0,\"milligram (10^-3)\",\"microgram (10^-6)\")","v":"milligram (10^-3)"},null,null,null,null,null,null,null,null,{"$f":"IF(Bodemkwaliteit!J48=0,\"milligram (10^-3)\",\"microgram (10^-6)\")","v":"milligram (10^-3)"}]
["PCB77",1E-4,null,null,{"$f":"IF(G28=\"\",\"\",IF(G28=\"<\",1,0))","v":1},1,"<",1E-3,6.9999999999999999E-4,{"$f":"IF($G$27=\"milligram (10^-3)\",I28*0.000001,IF($G$27=\"microgram (10^-6)\",I28*0.001,\"fout\"))","v":6.9999999999999996E-10},{"$f":"J28*B28","v":7.0000000000000005E-14},null,null,{"$f":"IF(P28=\"\",\"\",IF(P28=\"<\",1,0))","v":1},1,"<",1E-3,6.9999999999999999E-4,{"$f":"IF($P$27=\"milligram (10^-3)\",R28*0.000001,IF($P$27=\"microgram (10^-6)\",R28*0.001,\"fout\"))","v":6.9999999999999996E-10},7.0000000000000005E-14]
["PCB81",2.9999999999999997E-4,null,null,{"$f":"IF(G29=\"\",\"\",IF(G29=\"<\",1,0))","v":1},1,"<",1E-3,6.9999999999999999E-4,{"$f":"IF($G$27=\"milligram (10^-3)\",I29*0.000001,IF($G$27=\"microgram (10^-6)\",I29*0.001,\"fout\"))","v":6.9999999999999996E-10},2.0999999999999996E-13,null,null,{"$f":"IF(P29=\"\",\"\",IF(P29=\"<\",1,0))","v":1},1,"<",1E-3,6.9999999999999999E-4,{"$f":"IF($P$27=\"milligram (10^-3)\",R29*0.000001,IF($P$27=\"microgram (10^-6)\",R29*0.001,\"fout\"))","v":6.9999999999999996E-10},2.0999999999999996E-13]
["PCB105",3.0000000000000001E-5,null,null,1,1,"<",1E-3,6.9999999999999999E-4,6.9999999999999996E-10,2.0999999999999999E-14,null,null,1,1,"<",1E-3,6.9999999999999999E-4,6.9999999999999996E-10,2.0999999999999999E-14]
["PCB114",3.0000000000000001E-5,null,null,1,1,"<",1E-3,6.9999999999999999E-4,6.9999999999999996E-10,2.0999999999999999E-14,null,null,1,1,"<",1E-3,6.9999999999999999E-4,6.9999999999999996E-10,2.0999999999999999E-14]
["PCB118",3.0000000000000001E-5,null,null,1,1,{"$f":"IF(Bodemkwaliteit!H52=\"\",\"\",Bodemkwaliteit!H52)","v":"<"},{"$f":"IF(V32=0,Bodemkwaliteit!I52,IF(V32=1,0.001*Bodemkwaliteit!I52,\"fout\"))","v":1E-3},6.9999999999999999E-4,6.9999999999999996E-10,2.0999999999999999E-14,null,null,1,1,{"$f":"IF(Bodemkwaliteit!J52=\"\",\"\",Bodemkwaliteit!J52)","v":"<"},{"$f":"IF(V32=0,Bodemkwaliteit!K52,IF(V32=1,0.001*Bodemkwaliteit!K52,\"fout\"))","v":1E-3},6.9999999999999999E-4,6.9999999999999996E-10,2.0999999999999999E-14,null,{"$f":"Bodemkwaliteit!J48","v":0}]
["PCB123",3.0000000000000001E-5,null,null,1,1,"<",1E-3,6.9999999999999999E-4,6.9999999999999996E-10,2.0999999999999999E-14,null,null,1,1,"<",1E-3,6.9999999999999999E-4,6.9999999999999996E-10,2.0999999999999999E-14]
["PCB126",0.1,null,null,1,1,"<",1E-3,6.9999999999999999E-4,6.9999999999999996E-10,7.0000000000000004E-11,null,null,1,1,"<",1E-3,6.9999999999999999E-4,6.9999999999999996E-10,7.0000000000000004E-11]
["PCB156",3.0000000000000001E-5,null,null,1,1,"<",1E-3,6.9999999999999999E-4,6.9999999999999996E-10,2.0999999999999999E-14,null,null,1,1,"<",1E-3,6.9999999999999999E-4,6.9999999999999996E-10,2.0999999999999999E-14]
["PCB157",3.0000000000000001E-5,null,null,1,1,"<",1E-3,6.9999999999999999E-4,6.9999999999999996E-10,2.0999999999999999E-14,null,null,1,1,"<",1E-3,6.9999999999999999E-4,6.9999999999999996E-10,2.0999999999999999E-14]
["PCB167",3.0000000000000001E-5,null,null,1,1,"<",1E-3,6.9999999999999999E-4,6.9999999999999996E-10,2.0999999999999999E-14,null,null,1,1,"<",1E-3,6.9999999999999999E-4,6.9999999999999996E-10,2.0999999999999999E-14]
["PCB169",0.03,null,null,1,1,"<",1E-3,6.9999999999999999E-4,6.9999999999999996E-10,2.0999999999999999E-11,null,null,1,1,"<",1E-3,6.9999999999999999E-4,6.9999999999999996E-10,2.0999999999999999E-11]
["PCB189",3.0000000000000001E-5,null,null,1,1,"<",1E-3,6.9999999999999999E-4,6.9999999999999996E-10,2.0999999999999999E-14,null,null,1,1,"<",1E-3,6.9999999999999999E-4,6.9999999999999996E-10,2.0999999999999999E-14]
[null,null,null,{"$f":"IF(AND(G32=\"\",E40=11,G41=28),1,0)","v":0},{"$f":"SUM(E9:E39)","v":12},null,null,null,null,null,null,null,{"$f":"IF(AND(P32=\"\",N40=11,P41=28),1,0)","v":0},{"$f":"SUM(N9:N39)","v":12}]
[null,"(aantal <d)",null,null,null,null,{"$f":"SUM(F9:F39)","v":29},null,null,null,null,null,null,null,null,{"$f":"SUM(O9:O39)","v":29}]
[null,null,null,null,null,null,null,null,null,{"$f":"IF(G47=\"som dioxines wordt niet bepaald\",1,0)","v":0},null,null,null,null,null,null,null,null,{"$f":"IF(P47=\"som dioxines wordt niet bepaald\",1,0)","v":0}]
["Som TEQ",null,null,null,null,null,null,null,null,null,{"$f":"SUM(K9:K39)","v":3.4199970000914472},null,"ng (nanogram)",null,null,null,"ng (nanogram)",null,null,{"$f":"SUM(T9:T39)","v":3.4199970000914472}]
[null,null,null,null,null,null,null,null,null,null,{"$f":"K43/10^3","v":3.4199970000914474E-3},null,"μg (microgram)",null,null,null,"μg (microgram)",null,null,{"$f":"T43/10^3","v":3.4199970000914474E-3}]
[null,null,null,null,null,null,null,null,{"$f":"IF(AND(G41=29,K43/10^6>=0.000011),1,0)","v":0},null,{"$f":"IF(J42=1,0.000011,IF(AND(G41=29,K43/10^6>=0.000011),0.000011,K43/10^6))","v":3.4199970000914474E-6},null,"mg (milligram)",null,null,null,"mg (milligram)",{"$f":"IF(AND(P41=29,T43/10^6>=0.000011),1,0)","v":0},null,{"$f":"IF(S42=1,0.000011,IF(AND(P41=29,T43/10^6>=0.000011),0.000011,T43/10^6))","v":3.4199970000914474E-6}]
[]
[null,null,null,null,null,null,{"$f":"IF(AND(I3=1,I4=1,I5=0),\"som dioxines wordt niet bepaald\",\"\")","v":""},null,null,null,null,null,null,null,null,{"$f":"IF(AND(R3=1,I4=1,I5=0),\"som dioxines wordt niet bepaald\",\"\")","v":""}]

{"sheet":"Bodemkwaliteit","index":8,"n_rows":76,"n_cols":95,"rows_kept":76,"cut":false,"hidden":false,"merged":[[34,24,34,25],[43,24,43,25],[44,24,44,25],[39,24,39,25],[40,24,40,25],[41,24,41,25],[42,24,42,25],[16,24,16,25],[17,24,17,25],[32,24,32,25],[29,24,29,25],[30,24,30,25],[31,24,31,25],[22,24,22,25],[2,7,2,10],[13,5,13,8],[14,6,14,8],[4,7,4,9],[15,24,15,25],[90,5,90,29],[87,5,87,29],[89,5,89,29],[2,11,2,45],[97,5,97,29],[91,5,91,29],[92,5,92,29],[93,5,93,29],[94,5,94,29],[96,5,96,29],[95,5,95,29],[61,6,61,27],[60,6,60,27],[3,11,3,45],[59,6,59,27],[3,7,3,10],[35,24,35,25],[36,24,36,25],[37,24,37,25],[38,24,38,25],[88,5,88,29],[47,24,47,25],[48,24,48,25],[49,24,49,25],[46,24,46,25],[62,29,62,30],[57,24,57,25],[22,7,22,8],[22,9,22,10],[21,5,21,10],[50,24,50,25],[51,24,51,25],[52,24,52,25],[53,24,53,25],[54,24,54,25],[55,24,55,25],[26,24,26,25],[27,24,27,25],[28,24,28,25],[24,24,24,25],[25,24,25,25],[21,73,21,74],[21,75,21,76],[8,43,8,44],[60,29,60,30],[61,29,61,30]]}
[null,null,null,null,null,"Regeling Bodemkwaliteit, bijlage B, tabel 1: Normwaarden voor toepassing van grond en baggerspecie op of in de bodem, ",null,null,null,null,null,null,null,null,null,null,null,null,null,null,null,null,null,null,null,null,null,null,null,null,null,null,null,null,null,null,null,null,null,null,null,null,null,null,null,null,null,null,"Als de grond wordt geclassificeerd als zijnde \"industrie<x<i-waarde\" kan deze in bepaalde gevallen onder gebiedspecifiek beleid inzetbaar zijn."]
[null,null,null,null,null,"voor de bodem waarop grond of bagger wordt toegepast en voor verspreiden van baggerspecie over het aangrenzende perceel.",null,null,null,null,null,null,null,null,null,null,null,null,null,null,null,null,null,null,null,null,null,null,null,null,null,null,null,null,null,null,null,null,null,null,null,null,null,null,null,null,null,null,"Indien dit niet aan de orde is kunt u ervoor keizen om in plaats van \"industrie<x<i-waarde\" de classificatie \"niet toepasbare grond\" weer te geven. "]
[null,null,null,null,null,"Project(code):",null,"< code >",null,null,null,"Partij < partijnaam >",null,null,null,null,null,null,null,null,null,null,null,null,null,null,null,null,null,null,null,null,null,null,null,null,null,null,null,null,null,null,null,null,null,null,null,null,1,"(1=weergave \"industrie<x<i-waarde\", 0=weergave \"niet-toepasbare grond\")"]
[null,null,null,null,null,"Datum toetsing:",null,"<datum>",null,null,null,"< meldnummer >"]
[null,null,null,null,null,"partijgrootte (ton)",null,10000,null,null,{"$f":"IF(AR5=\"< < < <\",\"<- blad 'Partijgrootte' volgen!\",\"\")","v":""},null,null,null,null,null,{"$f":"IF(H5<=AR5,1,\"niet mogelijk\")","v":1},null,null,null,null,null,null,null,null,null,null,null,null,null,null,null,"maximale partijgrootte cfrm eisen Rbk en protocol 1001:",null,null,null,null,null,null,null,null,null,null,{"$f":"IF(H8=0,0,Partijgrootte!F59)","v":10000},"ton",null,null,null,null,null,null,null,null,null,null,null,"uit Bbk:",null,"uit tabel 1 als  niet aangesloten of veelvoudige afkomst"]
[null,null,null,null,null,"soort keuring->gebruiker=1; handhaver=0",null,1,{"$f":"IF(H6=1,\"Zekerheidsfactor =\",IF(H6=0,\"Afkeurfactor =\",\"fout\"))","v":"Zekerheidsfactor ="},{"$f":"IF(H6=1,AE6,IF(H6=0,AR6,\"fout\"))","v":1},null,null,null,null,null,null,{"$f":"IF(H6=1,J6,IF(H6=0,1/J6,\"fout\"))","v":1},null,null,null,null,null,null,null,null,null,null,null,null,"standaard zekerheidsfactor ZF =",1,null,"standaard afkeurfactor AF=",null,null,null,null,null,null,null,null,null,null,1.4,null,null,null,null,null,null,null,null,null,null,null,null,10000,null,2000,{"$f":"Partijgrootte!F59","v":10000}]
[null,null,null,null,null,"betreft het een keuring ihkv BRL9335?",null,0,"(1=ja;0=nee)",{"$f":"IF(AND(H5>BG6,H7=1,H8=1),\"Opmerking:  conform par. 6.5 van BRL9335 is de maximale partijgrootte voor samengestelde partijen\",\"\")","v":""},null,null,null,null,null,null,null,null,null,null,null,null,null,null,null,null,null,null,null,null,{"$f":"IF(AND(H5>BG6,H7=1,H8=0),BG6,\"\")","v":""},null,{"$f":"IF(AND(H5>BG6,H7=1,H8=0),\"ton.\",\"\")","v":""}]
[null,null,null,null,null,"blad partijgrootte doorlopen?:",null,1,"(1=ja;0=nee)",{"$f":"IF(AND(H7=1,H8=1),\"de indicatieve kwaliteit van de samengevoegde partijen is:\",\"\")","v":""},null,null,null,null,null,null,null,null,null,null,null,null,null,null,null,2,null,null,null,{"$f":"IF(AND(H7=1,H8=1),\"(1=AW2000;2=wonen;3=industrie)\",\"\")","v":""},null,null,{"$f":"IF(Z8=1,1,IF(Z8=2,2,IF(Z8=3,3,\"\")))","v":2},null,null,null,null,null,null,null,null,null,null,null,null,null,null,null,null,null,null,null,null,null,null,null,{"$f":"IF(AND(H7=1,Z8=1),\"AW2000\",IF(AND(H7=1,Z8=2),\"wonen\",IF(AND(H7=1,Z8=3),\"industrie\",\"\")))","v":""}]
[null,null,null,null,null,"betreft het baggerspecie in een grootschalige toepassing?",null,null,null,null,0,"(1=ja;0=nee)",null,null,null,null,null,null,null,null,null,null,null,null,null,null,null,null,null,null,null,null,null,null,null,null,null,null,null,null,null,null,null,null,null,null,null,null,null,null,null,null,null,null,null,null,"2013-01-01",{"$f":"BE9","v":41275},"2014-01-01",{"$f":"BG9","v":41640}]
[null,null,null,null,null,"betreft het thermisch gereinigde grond/baggerspecie?",null,null,null,null,0,"(1=ja;0=nee)",null,null,null,null,null,null,null,null,null,null,null,null,null,null,null,null,null,null,null,null,null,null,null,null,null,null,null,null,null,null,null,{"$f":"Partijgrootte!I11","v":1},null,null,null,null,null,null,null,null,null,null,null,null,"2013-07-01",{"$f":"BE10","v":41456}]
[null,null,null,null,null,"betreft het een partij zeezand niet toegepast in zout water?",null,null,null,null,0,"(1=ja;0=nee)",null,null,null,null,null,null,null,null,null,null,null,null,null,null,null,null,null,null,null,null,null,null,null,null,null,null,null,null,null,null,null,null,null,null,null,null,null,null,null,null,null,null,null,null,"2015-01-01",{"$f":"BE11","v":42005},"nu:",{"$f":"NOW()","v":"2017-05-03T15:30:46.910"},{"$f":"BH11","v":42858.646376273151}]
[null,null,null,null,null,"betreft het tarragrond waarin org. stoffen als gevolg van natuurlijke processen?",null,null,null,null,0,"(1=ja;0=nee)"]
[null,null,null,null,null,"betreft het (schone en onverdachte) tarragrond van aardappelen?",null,null,null,null,0,"(1=ja;0=nee)",null,null,null,null,null,null,null,null,"toepassing v/deze aardappeltarra op de bodem of oever van een opp.waterlichaam?",null,null,null,null,null,null,null,null,null,null,0,"(1=ja;0=nee)"]
[null,null,null,null,null,"percentage bodemvreemd materiaal:",null,null,null,1,"% m/m",{"$f":"IF(J14<=AR14,1,\"niet mogelijk\")","v":1},null,null,null,null,null,null,null,null,null,null,null,null,null,null,null,null,null,null,null,null,"max. %-age bodemvreemd materiaal conform art. 34 Bbk:",null,null,null,null,null,null,null,null,null,null,20,"% m/m",null,null,null,null,null,null,null,null,null,null,null,"Rapportagegrens"]
[null,null,null,null,null,"grepen:","2 maal ",null,null,50,null,null,null,null,null,null,null,null,null,null,null,null,null,null,null,null,null,null,null,"Rbk, art. 4.2.2-4","X",null,"Y"]
[null,null,null,null,null,"Macroparameters",null,null,"M--A",null,"M--B","M--gem",null,null,null,null,null,null,null,null,null,null,null,null,"M--reken",null,null,null,null,"X- en Y-waarden",2,null,1,null,null,null,null,null,null,null,null,null,null,null,null,null,null,null,null,null,null,null,"Labo-d of BG",null,null,null,"BG","ag","Labo-d","AS3000"]
[null,null,null,null,null,"pH-waarde",null,null,7,null,7,{"$f":"(I17+K17)/2","v":7},null,null,null,null,null,null,null,null,null,null,null,null,{"$f":"L17","v":7},null,null,null,null,"voor toetsing",7,null,2,null,null,null,null,null,null,null,null,null,null,null,null,null,null,null,null,null,null,null,null,null,null,null,"rap-grens",null,"AP04","AG r,eis"]
[null,null,null,null,null,"droge stof gehalte (massa-%)",null,null,100,null,100,{"$f":"(I18+K18)/2","v":100},null,null,null,null,null,null,null,null,null,null,null,null,{"$f":"L18","v":100},null,null,null,null,"aan de",16,null,3,null,null,null,null,null,null,null,null,null,null,null,null,null,null,null,null,null,null,null,null,null,{"$f":"F17","v":"pH-waarde"},null,null,"n.v.t.",null,"n.v.t.",null,"heeft te maken","met","tarra"]
[null,null,null,null,null,"lutum gehalte in % d.s.",null,null,25,null,25,{"$f":"(I19+K19)/2","v":25},null,null,null,null,null,null,null,null,null,null,null,null,{"$f":"IF(I19<2,2,I19)","v":25},{"$f":"IF(K19<2,2,K19)","v":25},null,null,null,"achtegrondwaarden",27,null,4,null,null,null,null,null,null,null,null,null,null,null,null,null,null,null,null,null,null,null,null,null,"droge stof",null,3.0000000000000001E-3,1E-3,null,"n.v.t."]
[null,null,null,null,null,"organisch stofgehalte in % d.s.",null,null,10,null,10,{"$f":"(I20+K20)/2","v":10},null,null,null,null,null,null,null,null,null,null,null,null,{"$f":"+IF(I20>30,30,IF(I20<2,2,I20))","v":10},{"$f":"+IF(K20>30,30,IF(K20<2,2,K20))","v":10},null,null,null,"(N,Tw-toets)",37,null,5,null,null,null,null,null,null,null,null,null,null,null,null,null,null,null,null,null,null,null,null,null,"lutum",null,1.4999999999999999E-2,5.0000000000000001E-3,null,0.01]
[null,null,null,null,null,"toetswijze:",1,null,"(1: toetsen gecorrigeerde gemiddelde meetwaarde aan standaard toetswaarden; 0: toetsen gemiddelde meetwaarde aan gecorrigeerde toetswaarden [pre 1-7-2013])"]
[null,null,null,null,null,"Parameter, opgaven in mg/kg d.s.",null,null,null,null,null,null,null,null,null,null,null,null,null,null,null,null,2.5,null,null,"=Y-max",null,null,null,null,null,null,null,null,null,null,null,null,null,null,null,null,null,null,null,null,null,null,null,null,null,null,null,null,"organische stof",null,6.0000000000000001E-3,2E-3,null,2E-3,null,"Rbk, waarden uit bijlage B, tabel 1",null,null,null,null,"Circulaire",null,null,null,"Rbk, bijlage G, tabel 1",null,null,"<1-7-2013",null,">1-7-2013"]
[null,null,null,null,null,null,null,"C[M--A]   mg/kg d.s.",null,"C[M--B]   mg/kg d.s.",null,"C[gem]","A",null,"B",null,"A*CF","B*CF","A-corr","B-corr","C[gem]-corr",null,"Ch:Cl",null,"toets",null,"<d,bniet2",null,null,{"$f":"IF(G21=1,\"AW2000\",\"AW2000-cor\")","v":"AW2000"},"aw-sec","AW of w","N,T-toets","a<x<2a","a<x<w","a<x<2a   \nen x<w","ax2ani","2a<x<w","2axw-ni",null,"w<x<ind","ind<x<i-w",">i-waarde",{"$f":"IF(G21=1,\"wonen\",\"wonen-cor\")","v":"wonen"},{"$f":"IF(G21=1,\"industrie\",\"industrie-cor\")","v":"industrie"},{"$f":"IF(G21=1,\"i-waarde\",\"i-waarde-cor\")","v":"i-waarde"},null,null,"N",null,"BG/d-i","BG/d-in","BG/d-w",null,null,null,null,null,null,null,null,"aw2000","wonen","industrie",null,null,"i-waarde",null,null,null,"a","b","c","A","B","A","B"]
[null,null,null,null,null,"1. Metalen",null,null,"mg/kg",null,"mg/kg",null,null,null,null,null,null,null,null,null,null,null,null,null,null,"<=AW2000"]
[null,null,null,null,null,{"$f":"IF(U25<920,\"barium\",\"barium, anropogeen (1=ja;0=nee)\")","v":"barium"},1,null,190,null,190,{"$f":"(Q25+R25)/2","v":190},{"$f":"IF(I25=\"\",\"\",IF(H25=\"<\",0.7*I25,I25))","v":190},{"$f":"IF(AE25=\"\",\"\",IF(AND(H25=\"<\",I25<=BE25,OR(AND(I25>AE25,$G$21=0),AND(I25>AE25*BV25,$G$21=1))),1,0))","v":0},{"$f":"IF(K25=\"\",\"\",IF(J25=\"<\",0.7*K25,K25))","v":190},{"$f":"IF(AE25=\"\",\"\",IF(AND(J25=\"<\",K25<=BE25,OR(AND(K25>AE25,$G$21=0),AND(K25>AE25*BV25,$G$21=1))),1,0))","v":0},{"$f":"IF(I25=\"\",\"\",IF(AND(H25=\"<\",G25=2),0.7*I25,$Q$6*M25))","v":190},{"$f":"IF(K25=\"\",\"\",IF(AND(J25=\"<\",G25=2),0.7*K25,$Q$6*O25))","v":190},{"$f":"IF(Q25=\"\",\"\",IF($G$21=0,Q25,IF($G$21=1,Q25*BX25,\"fout\")))","v":190},{"$f":"IF(R25=\"\",\"\",IF($G$21=0,R25,IF($G$21=1,R25*BY25,\"fout\")))","v":190},{"$f":"IF(OR(Q25=\"\",R25=\"\"),\"\",(S25+T25)/2)","v":190},null,{"$f":"IF(OR(I25=\"\",K25=\"\"),\"\",MAX(I25/K25,K25/I25))","v":1},{"$f":"IF(W25>$W$22,1,0)","v":0},{"$f":"IF(U25=\"\",\"\",IF(COUNTBLANK(AE25)=1,\"\",IF(AND(COUNTBLANK(AT25)=0,U25>AT25),\">i-waarde\",IF(AND(N25=1,P25=1),\"<=AW2000\",IF(AND(COUNTBLANK(AS25)=0,U25>AS25),\">Eis industrie\",IF(AND(COUNTBLANK(AR25)=0,U25>AR25),\">Eis wonen\",IF(U25>AD25,\">AW2000\",IF(U25<=AE25,\"<=AW2000\",\"\"))))))))","v":"<=AW2000"},null,{"$f":"IF(AND(N25=1,P25=1),1,0)","v":0},{"$f":"IF(OR(Y25=\">AW2000\",Y25=\">Eis wonen\",Y25=\">Eis industrie\"),1,0)","v":0},{"$f":"IF(Y25=\">i-waarde\",1,0)","v":0},{"$f":"IF(AE25=\"\",\"\",AE25)","v":920},{"$f":"IF($G$21=0,BJ25*(BV25+BW25)/2,BJ25)","v":920},{"$f":"IF(AE25=\"\",\"\",IF(2*AE25<AR25,2*AE25,AR25))","v":920},{"$f":"+IF(U25=\"\",\"\",IF(COUNTBLANK(AE25)=1,\"\",IF(OR(Y25=\"<=AW2000\",U25<=AD25),\"<=AW2000\",IF(AND(AH25=1,AO25=0,AP25=0,AQ25=0),\"AW2000<x<=2*AW2000\",IF(AI25=1,\"AW2000<x<=wonen\",IF(AO25=1,\"wonen<x<=industrie\",IF(AP25=1,\"industrie<x<=i-waarde\",IF(AQ25=1,\">i-waarde\",\"\"))))))))","v":"<=AW2000"},{"$f":"IF(AA25=1,\"\",IF(AE25=\"\",\"\",IF(AND(U25>AD25,U25<=2*AE25),1,0)))","v":0},{"$f":"IF(AA25=1,\"\",IF(AE25=\"\",\"\",IF(AND(COUNTBLANK(AR25)=0,U25>AD25,U25<=AR25),1,0)))","v":0},{"$f":"IF(AA25=1,\"\",IF(AE25=\"\",\"\",IF(AND(COUNTBLANK(AR25)=0,U25>AD25,U25<=2*AE25),1,0)))","v":0},null,{"$f":"IF(AA25=1,\"\",IF(AE25=\"\",\"\",IF(Y25=\"<=AW2000\",0,IF(AND(COUNTBLANK(AR25)=0,U25>2*AE25),1,0))))","v":0},{"$f":"IF(AA25=1,\"\",IF(Y25=\"<=AW2000\",0,IF(AE25=\"\",\"\",IF(AND(COUNTBLANK(AR25)=0,U25>2*AE25),1,0))))","v":0},{"$f":"IF(AA25=1,\"\",IF(AE25=\"\",\"\",IF(AL25>0,1,0)))","v":0},{"$f":"IF(AA25=1,\"\",IF(Y25=\"<=AW2000\",0,IF(AND(COUNTBLANK(AR25:AS25)=0,U25>AR25,U25<=AS25),1,0)))","v":0},{"$f":"IF(AA25=1,\"\",IF(Y25=\"<=AW2000\",0,IF(AND(COUNTBLANK(AS25:AT25)=0,U25>AS25,U25<=AT25),1,0)))","v":0},{"$f":"IF(AND(COUNTBLANK(AT25)=0,U25>AT25),1,0)","v":0},{"$f":"IF(BK25=\"\",\"\",IF($G$21=0,BK25*(BV25+BW25)/2,BK25))","v":920},{"$f":"IF(BL25=\"\",\"\",IF($G$21=0,BL25*(BV25+BW25)/2,BL25))","v":920},{"$f":"IF(BO25=\"\",\"\",IF($G$21=0,BO25*(BV25+BW25)/2,BO25))","v":920},null,null,null,null,{"$f":"IF(AND(H25=\"<\",J25=\"<\",I25=K25,Q25>AU25),1,0)","v":0},{"$f":"IF(AND(H25=\"<\",J25=\"<\",I25=K25,Q25>AS25),1,0)","v":0},{"$f":"IF(AND(H25=\"<\",J25=\"<\",I25=K25,Q25>AR25),1,0)","v":0},null,null,{"$f":"BZ25","v":"barium"},20,13,15,15,null,{"$f":"IF(AND($G$25=0,$U$25>920),10000,920)","v":920},{"$f":"IF(AND($G$25=0,$U$25>920),10000,920)","v":920},{"$f":"IF(AND($G$25=0,$U$25>920),10000,920)","v":920},null,null,{"$f":"IF(AND($G$25=0,$U$25>920),10000,920)","v":920},"L-Barium",10,null,30,5,0,{"$f":"((BS25+IF(AND($Y$19<$BQ$25,$K$10=1),$BQ$25*BT25,$Y$19*BT25)+$Y$20*BU25)/(BS25+25*BT25+10*BU25))","v":1},{"$f":"((BS25+IF(AND($Z$19<$BQ$25,$K$10=1),$BQ$25*BT25,$Z$19*BT25)+$Z$20*BU25)/(BS25+25*BT25+10*BU25))","v":1},{"$f":"((BS25+25*BT25+10*BU25)/(BS25+IF(AND($Y$19<$BQ$25,$K$10=1),$BQ$25*BT25,$Y$19*BT25)+$Y$20*BU25))","v":1},{"$f":"((BS25+25*BT25+10*BU25)/(BS25+IF(AND($Z$19<$BQ$25,$K$10=1),$BQ$25*BT25,$Z$19*BT25)+$Z$20*BU25))","v":1},{"$f":"F25","v":"barium"}]
[null,null,null,null,null,"cadmium",null,null,0.6,null,0.6,0.6,0.6,0,0.6,0,0.6,0.6,0.6,0.6,0.6,null,1,0,"<=AW2000",null,0,0,0,0.6,0.6,1.2,"<=AW2000",0,0,0,null,0,0,0,0,0,0,1.2,4.3,13,null,null,{"$f":"IF(Q26=\"\",\"\",1)","v":1},null,0,0,0,null,null,"cadmium",0.2,0.1,0.17,0.17,null,0.6,1.2,4.3,null,null,13,null,null,null,0.4,7.0000000000000001E-3,2.1000000000000001E-2,1,1,1,1,"cadmium"]
[null,null,null,null,null,"kobalt",null,null,15,null,15,15,15,0,15,0,15,15,15,15,15,null,1,0,"<=AW2000",null,0,0,0,15,15,30,"<=AW2000",0,0,0,null,0,0,0,0,0,0,35,190,190,null,null,1,null,0,0,0,null,null,"kobalt",3,0.7,1,1,null,15,35,190,null,null,190,null,null,null,2,0.28000000000000003,0,1,1,1,1,"kobalt"]
[null,null,null,null,null,"koper",null,null,40,null,40,40,40,0,40,0,40,40,40,40,40,null,1,0,"<=AW2000",null,0,0,0,40,40,54,"<=AW2000",0,0,0,null,0,0,0,0,0,0,54,190,190,null,null,1,null,0,0,0,null,null,"koper",5,1.7,5,5,null,40,54,190,null,null,190,null,null,null,15,0.6,0.6,1,1,1,1,"koper"]
[null,null,null,null,null,"kwik",null,null,0.15,null,0.15,0.15,0.15,0,0.15,0,0.15,0.15,0.15,0.15,0.15,null,1,0,"<=AW2000",null,0,0,0,0.15,0.15,0.3,"<=AW2000",0,0,0,null,0,0,0,0,0,0,0.83,4.8,36,null,null,1,null,0,0,0,null,null,"kwik",0.05,0.01,0.05,0.05,null,0.15,0.83,4.8,null,null,36,null,null,null,0.2,3.3999999999999998E-3,1.6999999999999999E-3,1,1,1,1,"kwik"]
[null,null,null,null,null,"lood",null,null,50,null,50,50,50,0,50,0,50,50,50,50,50,null,1,0,"<=AW2000",null,0,0,0,50,50,100,"<=AW2000",0,0,0,null,0,0,0,0,0,0,210,530,530,null,null,1,null,0,0,0,null,null,"lood",10,1,3,3,null,50,210,530,null,null,530,null,null,null,50,1,1,1,1,1,1,"lood"]
[null,null,null,null,null,"molybdeen",null,null,0.5,null,0.5,0.5,0.5,0,0.5,0,0.5,0.5,0.5,0.5,0.5,null,1,0,"<=AW2000",null,0,0,0,1.5,1.5,3,"<=AW2000",0,0,0,null,0,0,0,0,0,0,88,190,190,null,null,1,null,0,0,0,null,null,"molybdeen",1.5,0.5,0.5,0.5,null,1.5,88,190,null,null,190,null,null,null,1,0,0,1,1,1,1,"molybdeen"]
[null,null,null,null,null,"nikkel",null,null,35,null,35,35,35,0,35,0,35,35,35,35,35,null,1,0,"<=AW2000",null,0,0,0,35,35,70,"<=AW2000",0,0,0,{"$f":"IF(AA32=1,\"\",IF(AE32=\"\",\"\",IF(AND(COUNTBLANK(AR32)=0,U32>AD32,U32<=2*AE32),1,0)))","v":0},0,null,0,0,0,0,70,100,100,null,null,1,null,0,0,0,null,null,"nikkel",4,4.3,13,13,null,35,{"$f":"IF(OR(AM60>0,AND(AJ60>AX66,AK60=1)),39,70)","v":70},100,null,null,100,null,null,null,10,1,0,1,1,1,1,"nikkel"]
[null,null,null,null,null,"zink",null,null,100,null,100,100,100,0,100,0,100,100,100,100,100,null,1,0,"<=AW2000",null,0,0,0,140,140,200,"<=AW2000",0,0,0,null,0,{"$f":"IF(AA33=1,\"\",IF(Y33=\"<=AW2000\",0,IF(AE33=\"\",\"\",IF(AND(COUNTBLANK(AR33)=0,U33>2*AE33),1,0))))","v":0},0,0,0,0,200,720,720,null,null,1,{"$f":"SUM(AW25:AW33)","v":8},0,0,0,null,null,"zink",20,7,17,17,null,140,200,720,null,null,720,null,null,null,50,3,1.5,1,1,1,1,"zink"]
[null,null,null,null,null,"4. Polycyclische aromatische koolwaterstoffen (PAK's)",null,null,null,null,null,null,null,null,null,null,null,null,null,null,null,null,null,null,null,{"$f":"+IF(COUNTBLANK(AE34)=1,\"\",IF(AND(COUNTBLANK(AT34)=0,Q34>AT34),\">i-waarde\",IF(AND(COUNTBLANK(AS34)=0,Q34>AS34),\">Eis industrie\",IF(AND(COUNTBLANK(AR34)=0,Q34>AR34),\">Eis wonen\",IF(K34>AD34,\">AW2000\",IF(Q34<=AE34,\"<=AW2000\",\"\"))))))","v":""},null,null,null,null,null,null,null,null,null,null,null,null,null,null,null,null,null,null,null,null,null,null,null,null,null,null,null,0,{"$f":"\"0=PAKvolgorde Rbk 1..10; 1= 1,3,2,4,6,5,7,10,8,9 [Alcontrol]; 2= 1,2,3,6,5,4,8,10,9,7 [Eurofins/Envirocontrol]; 3= 1,2,3,4,6,5,8,7,10,9 [Omegam]; 4= 3,6,10,8,7,5,2,4,9,1 [AL-West/Agrolab]; 5= 3,2,1,4,6,5,8,7,10,9 [Agrolab]\"","v":"0=PAKvolgorde Rbk 1..10; 1= 1,3,2,4,6,5,7,10,8,9 [Alcontrol]; 2= 1,2,3,6,5,4,8,10,9,7 [Eurofins/Envirocontrol]; 3= 1,2,3,4,6,5,8,7,10,9 [Omegam]; 4= 3,6,10,8,7,5,2,4,9,1 [AL-West/Agrolab]; 5= 3,2,1,4,6,5,8,7,10,9 [Agrolab]"},null,null,null,null,null,null,null,null,null,null,null,null,null,null,null,null,null,null,null,null,null,null,"4. Polycyclische aromatische koolwaterstoffen (PAK's)"]
[null,null,{"$f":"(IF(AND(ISNUMBER(I35)=TRUE,ISNUMBER(K35)=TRUE),1,0))","v":1},null,null,{"$f":"IF(BB34=0,\"naftaleen\",IF(BB34=1,\"naftaleen\",IF(BB34=2,\"naftaleen\",IF(BB34=3,\"naftaleen\",IF(BB34=4,\"antraceen\",IF(BB34=5,\"antraceen\",\"fout\"))))))","v":"naftaleen"},{"$f":"IF(AND(H35=\"<\",J35=\"<\"),1,0)","v":1},"<",0.01,"<",0.01,{"$f":"(Q35+R35)/2","v":6.9999999999999993E-3},{"$f":"IF(I35=\"\",\"\",IF(H35=\"<\",0.7*I35,I35))","v":6.9999999999999993E-3},{"$f":"IF(AE35=\"\",\"\",IF(AND(H35=\"<\",I35<=BE35,OR(AND(I35>AE35,$G$21=0),AND(I35>AE35*BV35,$G$21=1))),1,0))","v":""},{"$f":"IF(K35=\"\",\"\",IF(J35=\"<\",0.7*K35,K35))","v":6.9999999999999993E-3},{"$f":"IF(AE35=\"\",\"\",IF(AND(J35=\"<\",K35<=BE35,OR(AND(K35>AE35,$G$21=0),AND(K35>AE35*BV35,$G$21=1))),1,0))","v":""},{"$f":"IF(I35=\"\",\"\",IF(AND(H35=\"<\",G35=2),0.7*I35,$Q$6*M35))","v":6.9999999999999993E-3},{"$f":"IF(K35=\"\",\"\",IF(AND(J35=\"<\",G35=2),0.7*K35,$Q$6*O35))","v":6.9999999999999993E-3},{"$f":"IF(Q35=\"\",\"\",IF($G$21=0,Q35,IF($G$21=1,Q35*BX35,\"fout\")))","v":6.9999999999999993E-3},{"$f":"IF(R35=\"\",\"\",IF($G$21=0,R35,IF($G$21=1,R35*BY35,\"fout\")))","v":6.9999999999999993E-3},{"$f":"IF(OR(Q35=\"\",R35=\"\"),\"\",(S35+T35)/2)","v":6.9999999999999993E-3},null,{"$f":"IF(OR(I35=\"\",K35=\"\"),\"\",MAX(I35/K35,K35/I35))","v":1},{"$f":"IF(W35>$W$22,1,0)","v":0},{"$f":"IF(U35=\"\",\"\",IF(COUNTBLANK(AE35)=1,\"\",IF(AND(COUNTBLANK(AT35)=0,U35>AT35),\">i-waarde\",IF(AND(N35=1,P35=1),\"<=AW2000\",IF(AND(COUNTBLANK(AS35)=0,U35>AS35),\">Eis industrie\",IF(AND(COUNTBLANK(AR35)=0,U35>AR35),\">Eis wonen\",IF(U35>AD35,\">AW2000\",IF(U35<=AE35,\"<=AW2000\",\"\"))))))))","v":""},null,{"$f":"IF(AND(N35=1,P35=1),1,0)","v":0},{"$f":"IF(OR(Y35=\">AW2000\",Y35=\">Eis wonen\",Y35=\">Eis industrie\"),1,0)","v":0},{"$f":"IF(Y35=\">i-waarde\",1,0)","v":0},{"$f":"IF(AE35=\"\",\"\",AE35)","v":""},{"$f":"IF(BJ35=\"\",\"\",IF($G$21=0,BJ35*(BV35+BW35)/2,BJ35))","v":""},{"$f":"IF(AE35=\"\",\"\",IF(2*AE35<AR35,2*AE35,AR35))","v":""},{"$f":"+IF(U35=\"\",\"\",IF(COUNTBLANK(AE35)=1,\"\",IF(OR(Y35=\"<=AW2000\",U35<=AD35),\"<=AW2000\",IF(AND(AH35=1,AO35=0,AP35=0,AQ35=0),\"AW2000<x<=2*AW2000\",IF(AI35=1,\"AW2000<x<=wonen\",IF(AO35=1,\"wonen<x<=industrie\",IF(AP35=1,\"industrie<x<=i-waarde\",IF(AQ35=1,\">i-waarde\",\"\"))))))))","v":""},"",{"$f":"IF(AA35=1,\"\",IF(AE35=\"\",\"\",IF(AND(COUNTBLANK(AR35)=0,U35>AD35,U35<=AR35),1,0)))","v":""},{"$f":"IF(AA35=1,\"\",IF(AE35=\"\",\"\",IF(AND(COUNTBLANK(AR35)=0,U35>AD35,U35<=2*AE35),1,0)))","v":""},null,{"$f":"IF(AA35=1,\"\",IF(AE35=\"\",\"\",IF(Y35=\"<=AW2000\",0,IF(AND(COUNTBLANK(AR35)=0,U35>2*AE35),1,0))))","v":""},null,{"$f":"IF(AA35=1,\"\",IF(AE35=\"\",\"\",IF(AL35>0,1,0)))","v":""},{"$f":"IF(AA35=1,\"\",IF(Y35=\"<=AW2000\",0,IF(AND(COUNTBLANK(AR35:AS35)=0,U35>AR35,U35<=AS35),1,0)))","v":0},{"$f":"IF(AA35=1,\"\",IF(Y35=\"<=AW2000\",0,IF(AND(COUNTBLANK(AS35:AT35)=0,U35>AS35,U35<=AT35),1,0)))","v":0},{"$f":"IF(AND(COUNTBLANK(AT35)=0,U35>AT35),1,0)","v":0},{"$f":"IF(BK35=\"\",\"\",IF($G$21=0,BK35*(BV35+BW35)/2,BK35))","v":""},{"$f":"IF(BL35=\"\",\"\",IF($G$21=0,BL35*(BV35+BW35)/2,BL35))","v":""},{"$f":"IF(BO35=\"\",\"\",IF($G$21=0,BO35*(BV35+BW35)/2,BO35))","v":""},null,null,null,null,{"$f":"IF(AND(H35=\"<\",J35=\"<\",I35=K35,Q35>AU35),1,0)","v":1},{"$f":"IF(AND(H35=\"<\",J35=\"<\",I35=K35,Q35>AS35),1,0)","v":0},{"$f":"IF(AND(H35=\"<\",J35=\"<\",I35=K35,Q35>AR35),1,0)","v":0},null,null,{"$f":"BZ35","v":"naftaleen"},0.05,2E-3,5.0000000000000001E-3,0.01,null,null,null,null,null,null,null,null,null,null,0,0,1,{"$f":"((BS35+$Y$19*BT35+(IF($Y$20<BR35,BR35*BU35,$Y$20*BU35))/(BS35+25*BT35+10*BU35)))","v":1},{"$f":"((BS35+$Z$19*BT35+(IF($Z$20<BR35,BR35*BU35,$Z$20*BU35))/(BS35+25*BT35+10*BU35)))","v":1},{"$f":"((BS35+25*BT35+10*BU35)/(BS35+$Y$19*BT35+IF($Y$20<BR35,BR35*BU35,$Y$20*BU35)))","v":1},{"$f":"((BS35+25*BT35+10*BU35)/(BS35+$Z$19*BT35+IF($Z$20<BR35,BR35*BU35,$Z$20*BU35)))","v":1},"naftaleen",null,{"$f":"IF(H35=\"<\",1,0)","v":1},{"$f":"IF(CB35=1,0.7*I35,I35)","v":6.9999999999999993E-3},null,{"$f":"IF(J35=\"<\",1,0)","v":1},{"$f":"IF(CE35=1,0.7*K35,K35)","v":6.9999999999999993E-3}]
[null,null,{"$f":"(IF(AND(ISNUMBER(I36)=TRUE,ISNUMBER(K36)=TRUE),1,0))","v":1},null,null,{"$f":"IF(BB34=0,\"fenantreen\",IF(BB34=1,\"antraceen\",IF(BB34=2,\"fenantreen\",IF(BB34=3,\"fenantreen\",IF(BB34=4,\"benzo(a)antraceen\",IF(BB34=5,\"fenantreen\",\"fout\"))))))","v":"fenantreen"},1,"<",0.01,"<",0.01,6.9999999999999993E-3,6.9999999999999993E-3,"",6.9999999999999993E-3,"",6.9999999999999993E-3,6.9999999999999993E-3,6.9999999999999993E-3,6.9999999999999993E-3,6.9999999999999993E-3,null,1,0,"",null,0,0,0,"","","","","","","",null,"",null,"",0,0,0,"","","",null,null,null,null,1,0,0,null,null,"fenantreen",0.05,3.0000000000000001E-3,0.01,0.01,null,null,null,null,null,null,null,null,null,null,0,0,1,1,1,1,1,"fenantreen",null,1,6.9999999999999993E-3,null,1,6.9999999999999993E-3]
[null,null,1,null,null,{"$f":"IF(BB34=0,\"antraceen\",IF(BB34=1,\"fenantreen\",IF(BB34=2,\"antraceen\",IF(BB34=3,\"antraceen\",IF(BB34=4,\"benzo(ghi)peryleen\",IF(BB34=5,\"naftaleen\",\"fout\"))))))","v":"antraceen"},1,"<",0.01,"<",0.01,6.9999999999999993E-3,6.9999999999999993E-3,"",6.9999999999999993E-3,"",6.9999999999999993E-3,6.9999999999999993E-3,6.9999999999999993E-3,6.9999999999999993E-3,6.9999999999999993E-3,null,1,0,"",null,0,0,0,"","","","","","","",null,"",null,"",0,0,0,"","","",null,null,null,null,1,0,0,null,null,"antraceen",0.05,3.0000000000000001E-3,0.01,0.01,null,null,null,null,null,null,null,null,null,null,0,0,1,1,1,1,1,{"$f":"F37","v":"antraceen"},null,1,6.9999999999999993E-3,null,1,6.9999999999999993E-3]
[null,null,1,null,null,{"$f":"IF(BB34=0,\"fluoranteen\",IF(BB34=1,\"fluoranteen\",IF(BB34=2,\"benzo(a)antraceen\",IF(BB34=3,\"fluoranteen\",IF(BB34=4,\"benzo(k)flouranteen\",IF(BB34=5,\"fluoranteen\",\"fout\"))))))","v":"fluoranteen"},1,"<",0.01,"<",0.01,6.9999999999999993E-3,6.9999999999999993E-3,"",6.9999999999999993E-3,"",6.9999999999999993E-3,6.9999999999999993E-3,6.9999999999999993E-3,6.9999999999999993E-3,6.9999999999999993E-3,null,1,0,"",null,0,0,0,"","","","","","","",null,"",null,"",0,0,0,"","","",null,null,null,null,1,0,0,null,null,"fluoranteen",0.05,3.0000000000000001E-3,0.01,0.01,null,null,null,null,null,null,null,null,null,null,0,0,1,1,1,1,1,"fluoranteen",null,1,6.9999999999999993E-3,null,1,6.9999999999999993E-3]
[null,null,1,null,null,{"$f":"IF(BB34=0,\"chryseen\",IF(BB34=1,\"benzo(a)antraceen\",IF(BB34=2,\"chryseen\",IF(BB34=3,\"benzo(a)antraceen\",IF(BB34=4,\"benzo(a)pyreen\",IF(BB34=5,\"benzo(a)antraceen\",\"fout\"))))))","v":"chryseen"},1,"<",0.01,"<",0.01,6.9999999999999993E-3,6.9999999999999993E-3,"",6.9999999999999993E-3,"",6.9999999999999993E-3,6.9999999999999993E-3,6.9999999999999993E-3,6.9999999999999993E-3,6.9999999999999993E-3,null,1,0,"",null,0,0,0,"","","","","","","",null,"",null,"",0,0,0,"","","",null,null,null,null,1,0,0,null,null,"chryseen",0.05,3.0000000000000001E-3,0.01,0.01,null,null,null,null,null,null,null,null,null,null,0,0,1,1,1,1,1,"chryseen",null,1,6.9999999999999993E-3,null,1,6.9999999999999993E-3]
[null,null,1,null,null,{"$f":"IF(BB34=0,\"benzo(a)antraceen\",IF(BB34=1,\"chryseen\",IF(BB34=2,\"fluoranteen\",IF(BB34=3,\"chryseen\",IF(BB34=4,\"chryseen\",IF(BB34=5,\"chryseen\",\"fout\"))))))","v":"benzo(a)antraceen"},1,"<",0.01,"<",0.01,6.9999999999999993E-3,6.9999999999999993E-3,"",6.9999999999999993E-3,"",6.9999999999999993E-3,6.9999999999999993E-3,6.9999999999999993E-3,6.9999999999999993E-3,6.9999999999999993E-3,null,1,0,"",null,0,0,0,"","","","","","","",null,"",null,"",0,0,0,"","","",null,null,null,null,1,0,0,null,null,"benzo(a)antraceen",0.05,3.0000000000000001E-3,0.01,0.01,null,null,null,null,null,null,null,null,null,null,0,0,1,1,1,1,1,"benzo(a)antraceen",null,1,6.9999999999999993E-3,null,1,6.9999999999999993E-3]
[null,null,1,null,null,{"$f":"IF(BB34=0,\"benzo(a)pyreen\",IF(BB34=1,\"benzo(a)pyreen\",IF(BB34=2,\"benzo(k)fluoranteen\",IF(BB34=3,\"benzo(k)fluoranteen\",IF(BB34=4,\"fenantreen\",IF(BB34=5,\"benzo(k)fluoranteen\",\"fout\"))))))","v":"benzo(a)pyreen"},1,"<",0.01,"<",0.01,6.9999999999999993E-3,6.9999999999999993E-3,"",6.9999999999999993E-3,"",6.9999999999999993E-3,6.9999999999999993E-3,6.9999999999999993E-3,6.9999999999999993E-3,6.9999999999999993E-3,null,1,0,"",null,0,0,0,"","","","","","","",null,"",null,"",0,0,0,"","","",null,null,null,null,1,0,0,null,null,"benzo(a)pyreen",0.05,3.0000000000000001E-3,0.01,0.01,null,null,null,null,null,null,null,null,null,null,0,0,1,1,1,1,1,"benzo(a)pyreen",null,1,6.9999999999999993E-3,null,1,6.9999999999999993E-3]
[null,null,1,null,null,{"$f":"IF(BB34=0,\"benzo(k)fluoranteen\",IF(BB34=1,\"benzo(ghi)peryleen\",IF(BB34=2,\"benzo(ghi)peryleen\",IF(BB34=3,\"benzo(a)pyreen\",IF(BB34=4,\"fluoranteen\",IF(BB34=5,\"benzo(a)pyreen\",\"fout\"))))))","v":"benzo(k)fluoranteen"},1,"<",0.01,"<",0.01,6.9999999999999993E-3,6.9999999999999993E-3,"",6.9999999999999993E-3,"",6.9999999999999993E-3,6.9999999999999993E-3,6.9999999999999993E-3,6.9999999999999993E-3,6.9999999999999993E-3,null,1,0,"",null,0,0,0,"","","","","","","",null,"",null,"",0,0,0,"","","",null,null,null,null,1,0,0,null,null,"benzo(k)fluoranteen",0.05,3.0000000000000001E-3,0.01,0.01,null,null,null,null,null,null,null,null,null,null,0,0,1,1,1,1,1,"benzo(k)fluoranteen",null,1,6.9999999999999993E-3,null,1,6.9999999999999993E-3]
[null,null,1,null,null,{"$f":"IF(BB34=0,\"indeno(1,2,3-cd)pyreen\",IF(BB34=1,\"benzo(k)fluoranteen\",IF(BB34=2,\"indeno(1,2,3-cd)pyreen\",IF(BB34=3,\"benzo(ghi)peryleen\",IF(BB34=4,\"indeno(1,2,3-cd)pyreen\",IF(BB34=5,\"benzo(ghi)peryleen\",\"fout\"))))))","v":"indeno(1,2,3-cd)pyreen"},1,"<",0.01,"<",0.01,6.9999999999999993E-3,6.9999999999999993E-3,"",6.9999999999999993E-3,"",6.9999999999999993E-3,6.9999999999999993E-3,6.9999999999999993E-3,6.9999999999999993E-3,6.9999999999999993E-3,null,1,0,"",null,0,0,0,"","","","","","","",null,"",null,"",0,0,0,"","","",null,null,null,null,1,0,0,null,null,"indeno(1,2,3-cd)pyreen",0.05,3.0000000000000001E-3,0.01,0.01,null,null,null,null,null,null,null,null,null,null,0,0,1,1,1,1,1,"indeno(1,2,3-cd)pyreen",null,1,6.9999999999999993E-3,null,1,6.9999999999999993E-3]
[null,null,1,null,null,{"$f":"IF(BB34=0,\"benzo(ghi)peryleen\",IF(BB34=1,\"indeno(1,2,3-cd)pyreen\",IF(BB34=2,\"benzo(a)pyreen\",IF(BB34=3,\"indeno(1,2,3-cd)pyreen\",IF(BB34=4,\"naftaleen\",IF(BB34=5,\"indeno(1,2,3-cd)pyreen\",\"fout\"))))))","v":"benzo(ghi)peryleen"},1,"<",0.01,"<",0.01,6.9999999999999993E-3,6.9999999999999993E-3,"",6.9999999999999993E-3,"",6.9999999999999993E-3,6.9999999999999993E-3,6.9999999999999993E-3,6.9999999999999993E-3,6.9999999999999993E-3,null,1,0,"",null,0,0,0,"","","","","","","",null,"",null,"",0,0,0,"","","",null,null,null,null,1,0,0,null,null,"benzo(ghi)peryleen",0.05,3.0000000000000001E-3,0.01,0.01,null,null,null,null,null,null,null,null,null,null,0,0,1,1,1,1,1,"benzo(ghi)peryleen",null,1,6.9999999999999993E-3,null,1,6.9999999999999993E-3]
[null,{"$f":"IF(SUM(C35:C45)>1,1,0)","v":1},1,null,null,"PAK's (10 VROM) (0,7 factor)",{"$f":"IF(AND(SUM(G35:G44)=7,H45=\"<\",J45=\"<\",((I45+K45)/2)>AE45),2,3)","v":3},{"$f":"IF(CD45=1,\"<\",\"\")","v":"<"},{"$f":"CC45","v":9.9999999999999992E-2},{"$f":"IF(CG45=1,\"<\",\"\")","v":"<"},{"$f":"CF45","v":9.9999999999999992E-2},6.9999999999999993E-2,6.9999999999999993E-2,0,6.9999999999999993E-2,0,6.9999999999999993E-2,6.9999999999999993E-2,6.9999999999999993E-2,6.9999999999999993E-2,6.9999999999999993E-2,null,1,0,"<=AW2000",null,0,0,0,1.5,1.5,3,"<=AW2000",{"$f":"IF(AA45=1,\"\",IF(AE45=\"\",\"\",IF(AND(U45>AD45,U45<=2*AE45),1,0)))","v":0},0,0,null,0,{"$f":"IF(AA45=1,\"\",IF(Y45=\"<=AW2000\",0,IF(AE45=\"\",\"\",IF(AND(COUNTBLANK(AR45)=0,U45>2*AE45),1,0))))","v":0},0,0,0,0,6.8,40,40,null,null,1,{"$f":"SUM(AW35:AW45)","v":1},1,0,0,null,null,"PAK's (10 VROM) (0,7 factor)",0.5,2.1000000000000001E-2,0.1,null,null,1.5,6.8,40,null,null,40,"H-PAK",null,10,0,0,1,1,1,1,1,"PAK's (10 VROM) (0,7 factor)",null,null,{"$f":"IF(CD45=1,SUM(I35:I44),SUM(CC35:CC44))","v":9.9999999999999992E-2},{"$f":"IF(SUM(CB35:CB44)=10,1,0)","v":1},null,{"$f":"IF(CG45=1,SUM(K35:K44),SUM(CF35:CF44))","v":9.9999999999999992E-2},{"$f":"IF(SUM(CE35:CE44)=10,1,0)","v":1}]
[null,null,null,null,null,"5. Gechloreerde koolwaterstoffen",null,null,null,null,null,null,null,null,null,null,null,null,null,null,null,null,null,null,null,{"$f":"+IF(COUNTBLANK(AE46)=1,\"\",IF(AND(COUNTBLANK(AT46)=0,Q46>AT46),\">i-waarde\",IF(AND(COUNTBLANK(AS46)=0,Q46>AS46),\">Eis industrie\",IF(AND(COUNTBLANK(AR46)=0,Q46>AR46),\">Eis wonen\",IF(K46>AD46,\">AW2000\",IF(Q46<=AE46,\"<=AW2000\",\"\"))))))","v":""},null,null,null,null,null,null,null,null,null,null,null,null,null,null,null,null,null,null,null,null,null,null,null,null,null,null,null,null,null,"5. Gechloreerde koolwaterstoffen",null,null,null,null,null,null,null,null,null,null,null,null,null,null,null,null,null,null,null,null,null,"5. Gechloreerde koolwaterstoffen"]
[null,null,null,null,null,"d. polichloorbifenylen (PCB's)",null,null,{"$f":"IF(J48=1,\"ug/kg\",IF(J48=0,\"mg/kg\",\"fout\"))","v":"mg/kg"},null,{"$f":"IF(J48=1,\"ug/kg\",IF(J48=0,\"mg/kg\",\"fout\"))","v":"mg/kg"},null,null,null,null,null,null,null,null,null,null,null,null,null,null,null,null,null,null,null,null,null,null,null,null,null,null,null,null,null,null,null,null,null,null,null,null,null,null,null,null,null,null,null,null,"d. polichloorbifenylen (PCB's)",null,null,null,null,null,null,null,null,null,null,null,null,null,null,null,null,null,null,null,"Circulaire",null,{"$f":"F47","v":"d. polichloorbifenylen (PCB's)"},null,null,null,null,null,null,null,null,null,null,null,null,null,"Rbk, waarden voor PCB uit bijlage B, tabel 1",null,null,"Circulaire"]
[null,null,null,null,null,"S.v.p. keuze voor toetsing PCB's opgeven (mg/kg=0 ; ug/kg=1):",null,null,null,0,null,null,null,null,null,null,null,null,null,null,null,null,null,null,null,null,null,null,null,null,null,null,null,null,null,null,null,null,null,null,null,null,null,null,null,null,null,null,null,null,null,null,null,null,null,"S.v.p. keuze voor toetsing PCB's opgeven (mg/kg=0 ; ug/kg=1):",null,null,null,null,null,null,null,null,null,null,null,null,null,null,null,null,null,null,null,"i-waarde",null,"S.v.p. keuze voor toetsing PCB's opgeven (mg/kg=0 ; ug/kg=1):",null,null,null,null,null,null,null,null,null,null,null,null,null,"aw2000","wonen","industrie","i-waarde"]
[null,null,null,null,null,"PCB 28",{"$f":"IF(AND(H49=\"<\",J49=\"<\"),1,0)","v":1},"<",1E-3,"<",1E-3,{"$f":"(Q49+R49)/2","v":6.9999999999999999E-4},{"$f":"IF(I49=\"\",\"\",IF(H49=\"<\",0.7*I49,I49))","v":6.9999999999999999E-4},{"$f":"IF(AE49=\"\",\"\",IF(AND(H49=\"<\",I49<=BE49,OR(AND(I49>AE49,$G$21=0),AND(I49>AE49*BV49,$G$21=1))),1,0))","v":""},{"$f":"IF(K49=\"\",\"\",IF(J49=\"<\",0.7*K49,K49))","v":6.9999999999999999E-4},{"$f":"IF(AE49=\"\",\"\",IF(AND(J49=\"<\",K49<=BE49,OR(AND(K49>AE49,$G$21=0),AND(K49>AE49*BV49,$G$21=1))),1,0))","v":""},{"$f":"IF(I49=\"\",\"\",IF(AND(H49=\"<\",G49=2),0.7*I49,$Q$6*M49))","v":6.9999999999999999E-4},{"$f":"IF(K49=\"\",\"\",IF(AND(J49=\"<\",G49=2),0.7*K49,$Q$6*O49))","v":6.9999999999999999E-4},{"$f":"IF(Q49=\"\",\"\",IF($G$21=0,Q49,IF($G$21=1,Q49*BX49,\"fout\")))","v":6.9999999999999999E-4},{"$f":"IF(R49=\"\",\"\",IF($G$21=0,R49,IF($G$21=1,R49*BY49,\"fout\")))","v":6.9999999999999999E-4},{"$f":"IF(OR(Q49=\"\",R49=\"\"),\"\",(S49+T49)/2)","v":6.9999999999999999E-4},null,{"$f":"IF(OR(I49=\"\",K49=\"\"),\"\",MAX(I49/K49,K49/I49))","v":1},{"$f":"IF(W49>$W$22,1,0)","v":0},{"$f":"IF(U49=\"\",\"\",IF(COUNTBLANK(AE49)=1,\"\",IF(AND(COUNTBLANK(AT49)=0,U49>AT49),\">i-waarde\",IF(AND(N49=1,P49=1),\"<=AW2000\",IF(AND(COUNTBLANK(AS49)=0,U49>AS49),\">Eis industrie\",IF(AND(COUNTBLANK(AR49)=0,U49>AR49),\">Eis wonen\",IF(U49>AD49,\">AW2000\",IF(U49<=AE49,\"<=AW2000\",\"\"))))))))","v":""},null,{"$f":"IF(AND(N49=1,P49=1),1,0)","v":0},{"$f":"IF(OR(Y49=\">AW2000\",Y49=\">Eis wonen\",Y49=\">Eis industrie\"),1,0)","v":0},{"$f":"IF(Y49=\">i-waarde\",1,0)","v":0},{"$f":"IF(AE49=\"\",\"\",AE49)","v":""},{"$f":"IF(BJ49=\"\",\"\",IF($G$21=0,BJ49*(BV49+BW49)/2,BJ49))","v":""},{"$f":"IF(AE49=\"\",\"\",IF(2*AE49<AR49,2*AE49,AR49))","v":""},{"$f":"+IF(U49=\"\",\"\",IF(COUNTBLANK(AE49)=1,\"\",IF(OR(Y49=\"<=AW2000\",U49<=AD49),\"<=AW2000\",IF(AND(AH49=1,AO49=0,AP49=0,AQ49=0),\"AW2000<x<=2*AW2000\",IF(AI49=1,\"AW2000<x<=wonen\",IF(AO49=1,\"wonen<x<=industrie\",IF(AP49=1,\"industrie<x<=i-waarde\",IF(AQ49=1,\">i-waarde\",\"\"))))))))","v":""},{"$f":"IF(AA49=1,\"\",IF(AE49=\"\",\"\",IF(AND(U49>AD49,U49<=2*AE49),1,0)))","v":""},{"$f":"IF(AA49=1,\"\",IF(AE49=\"\",\"\",IF(AND(COUNTBLANK(AR49)=0,U49>AD49,U49<=AR49),1,0)))","v":""},{"$f":"IF(AA49=1,\"\",IF(AE49=\"\",\"\",IF(AND(COUNTBLANK(AR49)=0,U49>AD49,U49<=2*AE49),1,0)))","v":""},null,{"$f":"IF(AA49=1,\"\",IF(AE49=\"\",\"\",IF(Y49=\"<=AW2000\",0,IF(AND(COUNTBLANK(AR49)=0,U49>2*AE49),1,0))))","v":""},null,{"$f":"IF(AA49=1,\"\",IF(AE49=\"\",\"\",IF(AL49>0,1,0)))","v":""},{"$f":"IF(AA49=1,\"\",IF(Y49=\"<=AW2000\",0,IF(AND(COUNTBLANK(AR49:AS49)=0,U49>AR49,U49<=AS49),1,0)))","v":0},{"$f":"IF(AA49=1,\"\",IF(Y49=\"<=AW2000\",0,IF(AND(COUNTBLANK(AS49:AT49)=0,U49>AS49,U49<=AT49),1,0)))","v":0},{"$f":"IF(AND(COUNTBLANK(AT49)=0,U49>AT49),1,0)","v":0},{"$f":"IF(BK49=\"\",\"\",IF($G$21=0,BK49*(BV49+BW49)/2,BK49))","v":""},{"$f":"IF(BL49=\"\",\"\",IF($G$21=0,BL49*(BV49+BW49)/2,BL49))","v":""},{"$f":"IF(BO49=\"\",\"\",IF($G$21=0,BO49*(BV49+BW49)/2,BO49))","v":""},null,null,null,null,{"$f":"IF(AND(H49=\"<\",J49=\"<\",I49=K49,Q49>AU49),1,0)","v":1},{"$f":"IF(AND(H49=\"<\",J49=\"<\",I49=K49,Q49>AS49),1,0)","v":0},{"$f":"IF(AND(H49=\"<\",J49=\"<\",I49=K49,Q49>AR49),1,0)","v":0},null,null,"PCB 28",{"$f":"IF($J$48=1,CI49*1000,IF($J$48=0,CI49,\"fout\"))","v":1E-3},{"$f":"IF($J$48=1,CJ49*1000,IF($J$48=0,B49,\"fout\"))","v":0},{"$f":"IF($J$48=1,CK49*1000,IF($J$48=0,CK49,\"fout\"))","v":0.01},{"$f":"IF($J$48=1,CL49*1000,IF($J$48=0,CL49,\"fout\"))","v":1.4E-2},null,null,null,null,null,null,null,null,null,null,0,0,1,{"$f":"((BS49+$Y$19*BT49+(IF($Y$20<BR49,BR49*BU49,$Y$20*BU49))/(BS49+25*BT49+10*BU49)))","v":1},{"$f":"((BS49+$Z$19*BT49+(IF($Z$20<BR49,BR49*BU49,$Z$20*BU49))/(BS49+25*BT49+10*BU49)))","v":1},{"$f":"((BS49+25*BT49+10*BU49)/(BS49+$Y$19*BT49+IF($Y$20<BR49,BR49*BU49,$Y$20*BU49)))","v":1},{"$f":"((BS49+25*BT49+10*BU49)/(BS49+$Z$19*BT49+IF($Z$20<BR49,BR49*BU49,$Z$20*BU49)))","v":1},"PCB 28",null,{"$f":"IF(H49=\"<\",1,0)","v":1},{"$f":"IF(CB49=1,0.7*I49,I49)","v":6.9999999999999999E-4},null,{"$f":"IF(J49=\"<\",1,0)","v":1},{"$f":"IF(CE49=1,0.7*K49,K49)","v":6.9999999999999999E-4},null,null,1E-3,8.7000000000000001E-4,0.01,1.4E-2,null,0.02,0.02,0.5]
[null,null,null,null,null,"PCB 52",{"$f":"IF(AND(H50=\"<\",J50=\"<\"),1,0)","v":1},"<",1E-3,"<",1E-3,6.9999999999999999E-4,6.9999999999999999E-4,"",6.9999999999999999E-4,"",6.9999999999999999E-4,6.9999999999999999E-4,6.9999999999999999E-4,6.9999999999999999E-4,6.9999999999999999E-4,null,1,0,"",null,0,0,0,"","","","","","","",null,"",null,"",0,0,0,"","","",null,null,null,null,1,0,0,null,null,"PCB 52",{"$f":"IF($J$48=1,CI50*1000,IF($J$48=0,CI50,\"fout\"))","v":1E-3},0,{"$f":"IF($J$48=1,CK50*1000,IF($J$48=0,CK50,\"fout\"))","v":0.01},{"$f":"IF($J$48=1,CL50*1000,IF($J$48=0,CL50,\"fout\"))","v":1.4E-2},null,null,null,null,null,null,null,null,null,null,0,0,1,1,1,1,1,"PCB 52",null,1,6.9999999999999999E-4,null,1,6.9999999999999999E-4,null,null,1E-3,8.7000000000000001E-4,0.01,1.4E-2,null,0.02,0.02,0.5]
[null,null,null,null,null,"PCB 101",1,"<",1E-3,"<",1E-3,6.9999999999999999E-4,6.9999999999999999E-4,"",6.9999999999999999E-4,"",6.9999999999999999E-4,6.9999999999999999E-4,6.9999999999999999E-4,6.9999999999999999E-4,6.9999999999999999E-4,null,1,0,"",null,0,0,0,"","","","","","","",null,"",null,"",0,0,0,"","","",null,null,null,null,1,0,0,null,null,"PCB 101",1E-3,0,0.01,1.4E-2,null,null,null,null,null,null,null,null,null,null,0,0,1,1,1,1,1,"PCB 101",null,1,6.9999999999999999E-4,null,1,6.9999999999999999E-4,null,null,1E-3,8.7000000000000001E-4,0.01,1.4E-2,null,0.02,0.02,0.5]
[null,null,null,null,null,"PCB 118",1,"<",1E-3,"<",1E-3,6.9999999999999999E-4,6.9999999999999999E-4,"",6.9999999999999999E-4,"",6.9999999999999999E-4,6.9999999999999999E-4,6.9999999999999999E-4,6.9999999999999999E-4,6.9999999999999999E-4,null,1,0,"",null,0,0,0,"","","","","","","",null,"",null,"",0,0,0,"","","",null,null,null,null,1,0,0,null,null,"PCB 118",1E-3,0,0.01,1.4E-2,null,null,null,null,null,null,null,null,null,null,0,0,1,1,1,1,1,"PCB 118",null,1,6.9999999999999999E-4,null,1,6.9999999999999999E-4,null,null,1E-3,8.7000000000000001E-4,0.01,1.4E-2,null,0.02,0.02,0.5]
[null,null,null,null,null,"PCB  138",1,"<",1E-3,"<",1E-3,6.9999999999999999E-4,6.9999999999999999E-4,"",6.9999999999999999E-4,"",6.9999999999999999E-4,6.9999999999999999E-4,6.9999999999999999E-4,6.9999999999999999E-4,6.9999999999999999E-4,null,1,0,"",null,0,0,0,"","","","","","","",null,"",null,"",0,0,0,"","","",null,null,null,null,1,0,0,null,null,"PCB  138",1E-3,0,0.01,1.4E-2,null,null,null,null,null,null,null,null,null,null,0,0,1,1,1,1,1,"PCB  138",null,1,6.9999999999999999E-4,null,1,6.9999999999999999E-4,null,null,1E-3,8.7000000000000001E-4,0.01,1.4E-2,null,0.02,0.02,0.5]
[null,null,null,null,null,"PCB 153",1,"<",1E-3,"<",1E-3,6.9999999999999999E-4,6.9999999999999999E-4,"",6.9999999999999999E-4,"",6.9999999999999999E-4,6.9999999999999999E-4,6.9999999999999999E-4,6.9999999999999999E-4,6.9999999999999999E-4,null,1,0,"",null,0,0,0,"","","","","","","",null,"",null,"",0,0,0,"","","",null,null,null,null,1,0,0,null,null,"PCB 153",1E-3,0,0.01,1.4E-2,null,null,null,null,null,null,null,null,null,null,0,0,1,1,1,1,1,"PCB 153",null,1,6.9999999999999999E-4,null,1,6.9999999999999999E-4,null,null,1E-3,8.7000000000000001E-4,0.01,1.4E-2,null,0.02,0.02,0.5]
[null,null,null,null,null,"PCB 180",1,"<",1E-3,"<",1E-3,6.9999999999999999E-4,6.9999999999999999E-4,"",6.9999999999999999E-4,"",6.9999999999999999E-4,6.9999999999999999E-4,6.9999999999999999E-4,6.9999999999999999E-4,6.9999999999999999E-4,null,1,0,"",null,0,0,0,"","","","","","","",null,"",null,"",0,0,0,"","","",null,null,null,null,1,0,0,null,null,"PCB 180",1E-3,0,0.01,1.4E-2,null,null,null,null,null,null,null,null,null,null,0,0,1,1,1,1,1,"PCB 180",null,1,6.9999999999999999E-4,null,1,6.9999999999999999E-4,null,null,1E-3,8.7000000000000001E-4,0.01,1.4E-2,null,0.02,0.02,0.5]
[null,null,null,1,null,"PCB's (som 7) (0,7 factor)",{"$f":"IF(AND(SUM(G49:G55)=7,H56=\"<\",J56=\"<\",((I56+104)/(IF($G$21=0,2,IF($G$21=1,2*BV36,\"fout\"))))>AE56),2,3)","v":2},{"$f":"IF(CD56=1,\"<\",\"\")","v":"<"},{"$f":"CC56","v":7.0000000000000001E-3},{"$f":"IF(CG56=1,\"<\",\"\")","v":"<"},{"$f":"CF56","v":7.0000000000000001E-3},4.8999999999999998E-3,4.8999999999999998E-3,0,4.8999999999999998E-3,0,4.8999999999999998E-3,4.8999999999999998E-3,4.8999999999999998E-3,4.8999999999999998E-3,4.8999999999999998E-3,null,1,0,"<=AW2000",null,0,0,0,0.02,0.02,0.04,"<=AW2000",{"$f":"IF(AA56=1,\"\",IF(AE56=\"\",\"\",IF(AND(U56>AD56,U56<=2*AE56),1,0)))","v":0},0,0,null,0,{"$f":"IF(AA56=1,\"\",IF(Y56=\"<=AW2000\",0,IF(AE56=\"\",\"\",IF(AND(COUNTBLANK(AR56)=0,U56>2*AE56),1,0))))","v":0},0,0,0,0,0.04,0.5,1,null,null,1,null,1,0,0,null,null,"PCB's (som 7) (0,7 factor)",7.0000000000000001E-3,0,0.01,1.4E-2,null,{"$f":"IF($J$48=1,CN56*1000,IF($J$48=0,CN56,\"fout\"))","v":0.02},{"$f":"IF($J$48=1,CO56*1000,IF($J$48=0,CO56,\"fout\"))","v":0.04},0.5,null,null,{"$f":"IF($J$48=1,CQ56*1000,IF($J$48=0,CQ56,\"fout\"))","v":1},null,null,null,0,0,1,1,1,1,1,"PCB's (som 7) (0,7 factor)",1,{"$f":"IF(CB52=0,1,0)","v":0},{"$f":"IF(CD56=1,SUM(I49:I55),SUM(CC49:CC55))","v":7.0000000000000001E-3},{"$f":"IF(SUM(CB49:CB55)=7,1,0)","v":1},{"$f":"IF(CE52=0,1,0)","v":0},{"$f":"IF(CG56=1,SUM(K49:K55),SUM(CF49:CF55))","v":7.0000000000000001E-3},{"$f":"IF(SUM(CE49:CE55)=7,1,0)","v":1},null,7.0000000000000001E-3,8.7000000000000001E-4,0.01,1.4E-2,null,0.02,0.04,0.5,1]
[null,null,null,null,null,"7. Overige stoffen",null,null,"mg/kg",null,"mg/kg",null,null,null,null,null,null,null,null,null,null,null,null,null,null,{"$f":"+IF(COUNTBLANK(AE57)=1,\"\",IF(AND(COUNTBLANK(AT57)=0,Q57>AT57),\">i-waarde\",IF(AND(COUNTBLANK(AS57)=0,Q57>AS57),\">Eis industrie\",IF(AND(COUNTBLANK(AR57)=0,Q57>AR57),\">Eis wonen\",IF(K57>AD57,\">AW2000\",IF(Q57<=AE57,\"<=AW2000\",\"\"))))))","v":""},null,null,null,null,null,null,null,null,null,null,null,null,null,null,null,null,null,null,null,null,null,null,null,null,null,null,null,null,null,{"$f":"BZ57","v":"7. Overige stoffen"},null,null,null,null,null,null,null,null,null,null,null,null,null,null,null,null,null,null,null,null,null,{"$f":"F57","v":"7. Overige stoffen"}]
[null,null,null,null,null,{"$f":"IF(AND(B60=0,OR(AB58=1,AC58=1)),\"minerale olie, NB: PAK en/of BETX bepalen!\",\"minerale olie\")","v":"minerale olie"},null,"<",20,"<",20,{"$f":"(Q58+R58)/2","v":14},{"$f":"IF(I58=\"\",\"\",IF(H58=\"<\",0.7*I58,I58))","v":14},{"$f":"IF(AE58=\"\",\"\",IF(AND(H58=\"<\",I58<=BE58,OR(AND(I58>AE58,$G$21=0),AND(I58>AE58*BV58,$G$21=1))),1,0))","v":0},{"$f":"IF(K58=\"\",\"\",IF(J58=\"<\",0.7*K58,K58))","v":14},{"$f":"IF(AE58=\"\",\"\",IF(AND(J58=\"<\",K58<=BE58,OR(AND(K58>AE58,$G$21=0),AND(K58>AE58*BV58,$G$21=1))),1,0))","v":0},{"$f":"IF(I58=\"\",\"\",IF(AND(H58=\"<\",G58=2),0.7*I58,$Q$6*M58))","v":14},{"$f":"IF(K58=\"\",\"\",IF(AND(J58=\"<\",G58=2),0.7*K58,$Q$6*O58))","v":14},{"$f":"IF(Q58=\"\",\"\",IF($G$21=0,Q58,IF($G$21=1,Q58*BX58,\"fout\")))","v":14},{"$f":"IF(R58=\"\",\"\",IF($G$21=0,R58,IF($G$21=1,R58*BY58,\"fout\")))","v":14},{"$f":"IF(OR(Q58=\"\",R58=\"\"),\"\",(S58+T58)/2)","v":14},null,{"$f":"IF(OR(I58=\"\",K58=\"\"),\"\",MAX(I58/K58,K58/I58))","v":1},{"$f":"IF(W58>$W$22,1,0)","v":0},{"$f":"IF(U58=\"\",\"\",IF(COUNTBLANK(AE58)=1,\"\",IF(AND(COUNTBLANK(AT58)=0,U58>AT58),\">i-waarde\",IF(AND(N58=1,P58=1),\"<=AW2000\",IF(AND(COUNTBLANK(AS58)=0,U58>AS58),\">Eis industrie\",IF(AND(COUNTBLANK(AR58)=0,U58>AR58),\">Eis wonen\",IF(U58>AD58,\">AW2000\",IF(U58<=AE58,\"<=AW2000\",\"\"))))))))","v":"<=AW2000"},null,{"$f":"IF(AND(N58=1,P58=1),1,0)","v":0},{"$f":"IF(OR(Y58=\">AW2000\",Y58=\">Eis wonen\",Y58=\">Eis industrie\"),1,0)","v":0},{"$f":"IF(Y58=\">i-waarde\",1,0)","v":0},{"$f":"IF(AE58=\"\",\"\",AE58)","v":190},{"$f":"IF(BJ58=\"\",\"\",IF($G$21=0,BJ58*(BV58+BW58)/2,BJ58))","v":190},{"$f":"IF(AE58=\"\",\"\",IF(2*AE58<AR58,2*AE58,AR58))","v":190},{"$f":"+IF(U58=\"\",\"\",IF(COUNTBLANK(AE58)=1,\"\",IF(OR(Y58=\"<=AW2000\",U58<=AD58),\"<=AW2000\",IF(AND(AH58=1,AO58=0,AP58=0,AQ58=0),\"AW2000<x<=2*AW2000\",IF(AI58=1,\"AW2000<x<=wonen\",IF(AO58=1,\"wonen<x<=industrie\",IF(AP58=1,\"industrie<x<=i-waarde\",IF(AQ58=1,\">i-waarde\",\"\"))))))))","v":"<=AW2000"},{"$f":"IF(AA58=1,\"\",IF(AE58=\"\",\"\",IF(AND(U58>AD58,U58<=2*AE58),1,0)))","v":0},{"$f":"IF(AA58=1,\"\",IF(AE58=\"\",\"\",IF(AND(COUNTBLANK(AR58)=0,U58>AD58,U58<=AR58),1,0)))","v":0},{"$f":"IF(AA58=1,\"\",IF(AE58=\"\",\"\",IF(AND(COUNTBLANK(AR58)=0,U58>AD58,U58<=2*AE58),1,0)))","v":0},null,{"$f":"IF(AA58=1,\"\",IF(AE58=\"\",\"\",IF(Y58=\"<=AW2000\",0,IF(AND(COUNTBLANK(AR58)=0,U58>2*AE58),1,0))))","v":0},{"$f":"IF(AA58=1,\"\",IF(Y58=\"<=AW2000\",0,IF(AE58=\"\",\"\",IF(AND(COUNTBLANK(AR58)=0,U58>2*AE58),1,0))))","v":0},{"$f":"IF(AA58=1,\"\",IF(AE58=\"\",\"\",IF(AL58>0,1,0)))","v":0},{"$f":"IF(AA58=1,\"\",IF(Y58=\"<=AW2000\",0,IF(AND(COUNTBLANK(AR58:AS58)=0,U58>AR58,U58<=AS58),1,0)))","v":0},{"$f":"IF(AA58=1,\"\",IF(Y58=\"<=AW2000\",0,IF(AND(COUNTBLANK(AS58:AT58)=0,U58>AS58,U58<=AT58),1,0)))","v":0},{"$f":"IF(AND(COUNTBLANK(AT58)=0,U58>AT58),1,0)","v":0},{"$f":"IF(BK58=\"\",\"\",IF($G$21=0,BK58*(BV58+BW58)/2,BK58))","v":190},{"$f":"IF(BL58=\"\",\"\",IF($G$21=0,BL58*(BV58+BW58)/2,BL58))","v":500},{"$f":"IF(BO58=\"\",\"\",IF($G$21=0,BO58*(BV58+BW58)/2,BO58))","v":5000},null,null,{"$f":"IF(Q58=\"\",\"\",1)","v":1},null,{"$f":"IF(AND(H58=\"<\",J58=\"<\",I58=K58,Q58>AU58),1,0)","v":1},{"$f":"IF(AND(H58=\"<\",J58=\"<\",I58=K58,Q58>AS58),1,0)","v":0},{"$f":"IF(AND(H58=\"<\",J58=\"<\",I58=K58,Q58>AR58),1,0)","v":0},null,null,"minerale olie",35,17,20,20,null,{"$f":"IF(K12=1,BO58,IF(K12=0,190,\"fout\"))","v":190},{"$f":"IF(K12=1,BO58,IF(K12=0,190,\"fout\"))","v":190},{"$f":"IF(K12=1,BO58,IF(AND(K12=0,K9=1),BN58,IF(AND(K12=0,K9=0),BM58,\"fout\")))","v":500},500,2000,5000,null,null,null,0,0,1,{"$f":"((BS58+$Y$19*BT58+(IF($Y$20<BR58,BR58*BU58,$Y$20*BU58))/(BS58+25*BT58+10*BU58)))","v":1},{"$f":"((BS58+$Z$19*BT58+(IF($Z$20<BR58,BR58*BU58,$Z$20*BU58))/(BS58+25*BT58+10*BU58)))","v":1},{"$f":"((BS58+25*BT58+10*BU58)/(BS58+$Y$19*BT58+IF($Y$20<BR58,BR58*BU58,$Y$20*BU58)))","v":1},{"$f":"((BS58+25*BT58+10*BU58)/(BS58+$Z$19*BT58+IF($Z$20<BR58,BR58*BU58,$Z$20*BU58)))","v":1},{"$f":"F58","v":"minerale olie"}]
[null,null,null,null,null,null,null,null,null,null,null,null,null,null,null,null,null,null,null,null,null,null,null,{"$f":"SUM(X25:X58)","v":0}]
[{"$f":"SUM(A25:A58)","v":0},{"$f":"SUM(B25:B58)","v":1},null,{"$f":"SUM(D25:D58)","v":1},{"$f":"SUM(E25:E58)","v":0},"C[M--A]","gemeten gehalte in monster A in mg/kg d.s.",null,null,null,null,null,null,null,null,null,null,null,null,null,null,null,null,null,null,null,null,null,{"$f":"SUM(AC25:AC58)","v":0},null,null,null,{"$f":"COUNTIF(AG25:AG58,Z24)","v":29},{"$f":"SUM(AH25:AH58)","v":0},0,0,0,0,0,0,0,0,0,null,null,null,null,{"$f":"SUM(AV25:AV58)","v":0},11,9,20,0,0]
[null,null,null,null,null,"C[M--B]","gemeten gehalte in monster B in mg/kg d.s.",null,null,null,null,null,null,null,null,null,null,null,null,null,null,null,null,null,null,null,null,null,null,"max. spreidingsmaat Ch:Cl=",null,{"$f":"MAX(W25:W58)","v":1},"N <=AW2000","a<x<2a","a<x<w","a<x<2a\nen x<w","ax2ani","2a<x<w","2axw-nipcb","N","w<x<ind","ind<x<i-w",">i-waarde",null,null,null,null,null,null,null,{"$f":"IF(OR(AY60>0,AZ60>0,BA60>0,BC60>0),1,0)","v":1}]
[null,null,null,null,null,"C[gem]","gemiddelde te toetsen gehalte",null,null,null,null,null,null,null,null,null,null,null,null,null,null,null,null,null,null,null,null,null,null,"zijn er Ch:Cl > Y:",null,{"$f":"IF(X59>0,\"ja\",\"nee\")","v":"nee"}]
[null,null,null,null,null,null,null,null,null,null,null,null,null,null,null,null,null,null,null,null,null,null,null,null,null,null,null,null,null,"aantal Ch:Cl > Y:",null,{"$f":"IF(AF61>1,SUM(X25:X58),\"geen\")","v":"geen"}]
[null,null,null,null,null,null,null,null,null,null,null,null,null,null,null,null,null,null,null,null,null,null,null,null,null,null,null,">AW2000",">i-waarde",null,null,null,{"$f":"COUNTIF(AG25:AG58,Z24)","v":29},{"$f":"SUM(AH25:AH58)","v":0},{"$f":"SUM(AI25:AI58)","v":0},{"$f":"SUM(AJ25:AJ58)","v":0},null,{"$f":"SUM(AL25:AL58)","v":0},null,null,{"$f":"SUM(AO25:AO58)","v":0},{"$f":"SUM(AP25:AP58)","v":0},{"$f":"SUM(AQ25:AQ58)","v":0},null,null,null,null,null,null,{"$f":"AW60","v":11},null,{"$f":"SUM(AZ31:AZ63)","v":0}]
[null,null,null,null,null,"AW2000","achtergrondwaarden"]
[null,null,null,null,null,"wonen","maximale waarden bodemfunctie klasse wonen",null,null,null,null,null,null,null,null,null,null,null,null,null,null,null,null,null,null,null,null,null,null,null,null,null,"N <=AW2000","a<x<2a","a<x<w","a<x<2a\nen x<w","ax2ani","2a<x<w","2axw-nipcb",null,"w<x<ind","ind<x<i-w",">i-waarde",null,null,null,null,null,null,{"$f":"IF(AX64<AE16,0,IF(AX64<AE17,AG16,IF(AX64<AE18,AG17,IF(AX64<AE19,AG18,IF(AX64<AE20,AG19,AG20)))))","v":2},null,{"$f":"IF(AND(AJ64<=AX66,AJ64>0,AL64=0,AO64=0,AP64=0,AQ64=0),1,0)","v":0},null,null,null,null,{"$f":"IF(AND(AH64=0,AI64=0,AO64=0,AP64=0,AQ64=0),1,0)","v":1}]
[null,null,null,null,null,"industrie","maximale waarden bodemfunctieklasse industrie",null,null,null,null,null,null,null,null,null,null,null,null,null,null,null,null,null,null,null,null,{"$f":"SUM(AB25:AB58)","v":0},{"$f":"SUM(AC25:AC58)","v":0},"Kwaliteitscontrole",null,null,null,null,null,null,null,null,null,null,null,null,null,null,null,null,null,null,null,"N,T",null,"voldoet N,T?",null,null,null,null,"AW2000?"]
[null,null,null,null,null,"i-waarde","interventiewaarde bodem",null,null,null,null,null,null,null,null,null,null,null,null,null,null,null,null,null,null,null,null,null,null,"betreffende de invoer van de correcte waarden uit het analysecertificaat en de gestelde conclusie:"]
[null,null,null,null,null,"toets","resultaat van de toetsing aan de samenstellingswaarden"]
[null,null,null,null,null,null,null,null,null,null,null,null,null,null,null,null,null,null,null,null,null,null,null,null,null,null,null,null,null,"Naam invoerder:",null,null,"Paraaf:",null,null,null,null,null,null,null,null,null,null,null,"Datum:",null,null,null,null,null,null,null,null,null,null,null,{"$f":"IF((I23=6),\"Opmerking: bij methode 2*6 geen notitie >2*bsb-1\",\"\")","v":""}]
[null,null,null,null,null,"Kwaliteit:",{"$f":"IF(AC60>=1,\"sterk verontreinigde grond\",IF(OR(AC67>0,Q5=\"niet mogelijk\",L14=\"niet mogelijk\",AND(K13=1,AF13=1)),\"niet toepasbare grond\",IF(AND(AC67=0,AB67=0),\"AW2000 grond\",\"bodemklasse\")))","v":"AW2000 grond"},null,null,{"$f":"IF(AND(G71=\"bodemklasse\",AP64>0),IF(AW3=1,\"industrie<x<i-waarde\",\"niet toepasbare grond\"),IF(AND(G71=\"bodemklasse\",AO64>0),\"industrie\",IF(AND(G71=\"bodemklasse\",AZ66=0,AI64>0),\"wonen\",IF(AND(G71=\"bodemklasse\",AZ66=1),\"zie N,T-toets\",\"\"))))","v":""},null,{"$f":"IF(AND(H7=1,AA71<AG8),\"Let op: Deze kwaliteit is beter dan voor samenvoeging\",\"\")","v":""},null,null,null,null,null,null,null,null,null,null,null,null,null,null,{"$f":"IF(J71=\"industrie\",3,IF(J71=\"wonen\",2,IF(OR(G71=\"AW2000 grond\",J71=\"zie N,T-toets\"),1,\"x\")))","v":1},null,null,null,{"$f":"IF(AND(H7=1,AA71>AG8,OR(BE8=\"AW2000\",BE8=\"wonen\",BE8=\"industrie\")),\"Conform BRL9335-1 is de eindkwaliteit:\",\"\")","v":""},null,null,null,null,null,null,null,null,null,null,null,null,{"$f":"IF(AND(H7=1,AA71>AG8,OR(BE8=\"AW2000\",BE8=\"wonen\",BE8=\"industrie\")),BE8,\"\")","v":""},null,null,null,null,null,{"$f":"IF(G71=\"\",0,IF(G71=\"niet toepasbare grond\",1,IF(G71=\"AW2000 grond\",2,IF(G71=\"bodemklasse\",3,\"fout\"))))","v":2},{"$f":"IF(J71=\"\",0,IF(J71=\"industrie<x<i-waarde\",1,IF(J71=\"industrie\",2,IF(J71=\"wonen\",3,IF(J71=\"zie N,T-toets\",4,\"fout\")))))","v":0},null,null,null,null,null,{"$f":"IF((I23=6),\"dit geldt in voorkomende gevallen alleen\",\"\")","v":""}]
[null,null,null,null,null,{"$f":"IF(OR(J71=\"niet toepasbare grond\",J71=\"industrie<x<i-waarde\",J71=\"\",J71=\"wonen\",J71=\"industrie\"),\"\",\"N,T-toets:\")","v":""},{"$f":"IF(G71=\"AW2000 grond\",\"AW2000\",IF(OR(J71=\"industrie<x<i-waarde\",J71=\"\",J71=\"wonen\",J71=\"industrie\"),\"\",IF(OR(G71=\"niet toepasbare grond\",J71=\"niet toepasbare grond\"),\"\",IF(J71=\"industrie\",\"industrie\",IF(J71=\"wonen\",\"wonen\",IF(AZ66=1,\"N,T-AW2000\",IF(BE66=1,\"AW2000\",\"niet\")))))))","v":"AW2000"},null,null,null,null,null,null,null,null,null,null,null,null,null,null,null,null,null,null,null,null,null,null,"Naam 2e lezer:",null,null,"Paraaf:",null,null,null,null,null,null,null,null,null,null,null,"Datum:",null,null,null,null,{"$f":"IF(J71=\"industrie\",1,IF(J71=\"wonen\",2,IF(G72=\"N,T-AW2000\",3,IF(G72=\"AW2000\",4,IF(G72=\"niet\",5,\"fout\")))))","v":4},null,null,null,null,null,null,{"$f":"IF((I23=6),\"voor toetsing AW2000 grond !!!\",\"\")","v":""}]
[null,null,null,null,null,null,{"$f":"IF(OR(G71=\"AW2000 grond\",G72=\"AW2000\",G72=\"N,T-AW2000\"),\"AW2000 grond is altijd vrij toepasbaar (voor wat betreft de chemische kwaliteit).\",\"\")","v":"AW2000 grond is altijd vrij toepasbaar (voor wat betreft de chemische kwaliteit)."},null,null,null,null,null,null,null,null,null,null,null,null,null,null,null,null,null,null,null,null,null,null,null,null,null,null,null,null,null,null,null,null,null,null,null,null,null,null,null,null,null,null,{"$f":"IF(F76=\"\",0,IF(F76=\"Let op: voor grootschalige toepassing uitloging uitvoeren en emissie bepalen!\",1,\"fout\"))","v":0}]
[]
[]
[null,null,null,null,null,{"$f":"IF('Grootschalige toepassing'!T42=1,\"Let op: voor grootschalige toepassing uitloging uitvoeren en emissie bepalen!\",\"\")","v":""}]

{"sheet":"Start","index":9,"n_rows":39,"n_cols":3,"rows_kept":39,"cut":false,"hidden":false,"merged":[[4,16203,4,16235],[4,16236,4,16268],[4,16269,4,16301],[4,16302,4,16334],[4,16335,4,16367],[4,16368,4,16383],[4,16005,4,16037],[4,16038,4,16070],[4,16071,4,16103],[4,16104,4,16136],[4,16137,4,16169],[4,16170,4,16202],[4,15807,4,15839],[4,15840,4,15872],[4,15873,4,15905],[4,15906,4,15938],[4,15939,4,15971],[4,15972,4,16004],[4,15609,4,15641],[4,15642,4,15674],[4,15675,4,15707],[4,15708,4,15740],[4,15741,4,15773],[4,15774,4,15806],[4,15411,4,15443],[4,15444,4,15476],[4,15477,4,15509],[4,15510,4,15542],[4,15543,4,15575],[4,15576,4,15608],[4,15213,4,15245],[4,15246,4,15278],[4,15279,4,15311],[4,15312,4,15344],[4,15345,4,15377],[4,15378,4,15410],[4,15015,4,15047],[4,15048,4,15080],[4,15081,4,15113],[4,15114,4,15146],[4,15147,4,15179],[4,15180,4,15212],[4,14817,4,14849],[4,14850,4,14882],[4,14883,4,14915],[4,14916,4,14948],[4,14949,4,14981],[4,14982,4,15014],[4,14619,4,14651],[4,14652,4,14684],[4,14685,4,14717],[4,14718,4,14750],[4,14751,4,14783],[4,14784,4,14816],[4,14421,4,14453],[4,14454,4,14486],[4,14487,4,14519],[4,14520,4,14552],[4,14553,4,14585],[4,14586,4,14618],[4,14223,4,14255],[4,14256,4,14288],[4,14289,4,14321],[4,14322,4,14354],[4,14355,4,14387],[4,14388,4,14420],[4,14025,4,14057],[4,14058,4,14090],[4,14091,4,14123],[4,14124,4,14156],[4,14157,4,14189],[4,14190,4,14222],[4,13827,4,13859],[4,13860,4,13892],[4,13893,4,13925],[4,13926,4,13958],[4,13959,4,13991],[4,13992,4,14024],[4,13629,4,13661],[4,13662,4,13694],[4,13695,4,13727],[4,13728,4,13760],[4,13761,4,13793],[4,13794,4,13826],[4,13431,4,13463],[4,13464,4,13496],[4,13497,4,13529],[4,13530,4,13562],[4,13563,4,13595],[4,13596,4,13628],[4,13233,4,13265],[4,13266,4,13298],[4,13299,4,13331],[4,13332,4,13364],[4,13365,4,13397],[4,13398,4,13430],[4,13035,4,13067],[4,13068,4,13100],[4,13101,4,13133],[4,13134,4,13166],[4,13167,4,13199],[4,13200,4,13232],[4,12837,4,12869],[4,12870,4,12902],[4,12903,4,12935],[4,12936,4,12968],[4,12969,4,13001],[4,13002,4,13034],[4,12639,4,12671],[4,12672,4,12704],[4,12705,4,12737],[4,12738,4,12770],[4,12771,4,12803],[4,12804,4,12836],[4,12441,4,12473],[4,12474,4,12506],[4,12507,4,12539],[4,12540,4,12572],[4,12573,4,12605],[4,12606,4,12638],[4,12243,4,12275],[4,12276,4,12308],[4,12309,4,12341],[4,12342,4,12374],[4,12375,4,12407],[4,12408,4,12440],[4,12045,4,12077],[4,12078,4,12110],[4,12111,4,12143],[4,12144,4,12176],[4,12177,4,12209],[4,12210,4,12242],[4,11847,4,11879],[4,11880,4,11912],[4,11913,4,11945],[4,11946,4,11978],[4,11979,4,12011],[4,12012,4,12044],[4,11649,4,11681],[4,11682,4,11714],[4,11715,4,11747],[4,11748,4,11780],[4,11781,4,11813],[4,11814,4,11846],[4,11451,4,11483],[4,11484,4,11516],[4,11517,4,11549],[4,11550,4,11582],[4,11583,4,11615],[4,11616,4,11648],[4,11253,4,11285],[4,11286,4,11318],[4,11319,4,11351],[4,11352,4,11384],[4,11385,4,11417],[4,11418,4,11450],[4,11055,4,11087],[4,11088,4,11120],[4,11121,4,11153],[4,11154,4,11186],[4,11187,4,11219],[4,11220,4,11252],[4,10857,4,10889],[4,10890,4,10922],[4,10923,4,10955],[4,10956,4,10988],[4,10989,4,11021],[4,11022,4,11054],[4,10659,4,10691],[4,10692,4,10724],[4,10725,4,10757],[4,10758,4,10790],[4,10791,4,10823],[4,10824,4,10856],[4,10461,4,10493],[4,10494,4,10526],[4,10527,4,10559],[4,10560,4,10592],[4,10593,4,10625],[4,10626,4,10658],[4,10263,4,10295],[4,10296,4,10328],[4,10329,4,10361],[4,10362,4,10394],[4,10395,4,10427],[4,10428,4,10460],[4,10065,4,10097],[4,10098,4,10130],[4,10131,4,10163],[4,10164,4,10196],[4,10197,4,10229],[4,10230,4,10262],[4,9867,4,9899],[4,9900,4,9932],[4,9933,4,9965],[4,9966,4,9998],[4,9999,4,10031],[4,10032,4,10064],[4,9669,4,9701],[4,9702,4,9734],[4,9735,4,9767],[4,9768,4,9800],[4,9801,4,9833],[4,9834,4,9866],[4,9471,4,9503],[4,9504,4,9536],[4,9537,4,9569],[4,9570,4,9602],[4,9603,4,9635],[4,9636,4,9668],[4,9273,4,9305],[4,9306,4,9338],[4,9339,4,9371],[4,9372,4,9404],[4,9405,4,9437],[4,9438,4,9470],[4,9075,4,9107],[4,9108,4,9140],[4,9141,4,9173],[4,9174,4,9206],[4,9207,4,9239],[4,9240,4,9272],[4,8877,4,8909],[4,8910,4,8942],[4,8943,4,8975],[4,8976,4,9008],[4,9009,4,9041],[4,9042,4,9074],[4,8679,4,8711],[4,8712,4,8744],[4,8745,4,8777],[4,8778,4,8810],[4,8811,4,8843],[4,8844,4,8876],[4,8481,4,8513],[4,8514,4,8546],[4,8547,4,8579],[4,8580,4,8612],[4,8613,4,8645],[4,8646,4,8678],[4,8283,4,8315],[4,8316,4,8348],[4,8349,4,8381],[4,8382,4,8414],[4,8415,4,8447],[4,8448,4,8480],[4,8085,4,8117],[4,8118,4,8150],[4,8151,4,8183],[4,8184,4,8216],[4,8217,4,8249],[4,8250,4,8282],[4,7887,4,7919],[4,7920,4,7952],[4,7953,4,7985],[4,7986,4,8018],[4,8019,4,8051],[4,8052,4,8084],[4,7689,4,7721],[4,7722,4,7754],[4,7755,4,7787],[4,7788,4,7820],[4,7821,4,7853],[4,7854,4,7886],[4,7491,4,7523],[4,7524,4,7556],[4,7557,4,7589],[4,7590,4,7622],[4,7623,4,7655],[4,7656,4,7688],[4,7293,4,7325],[4,7326,4,7358],[4,7359,4,7391],[4,7392,4,7424],[4,7425,4,7457],[4,7458,4,7490],[4,7095,4,7127],[4,7128,4,7160],[4,7161,4,7193],[4,7194,4,7226],[4,7227,4,7259],[4,7260,4,7292],[4,6897,4,6929],[4,6930,4,6962],[4,6963,4,6995],[4,6996,4,7028],[4,7029,4,7061],[4,7062,4,7094],[4,6699,4,6731],[4,6732,4,6764],[4,6765,4,6797],[4,6798,4,6830],[4,6831,4,6863],[4,6864,4,6896],[4,6501,4,6533],[4,6534,4,6566],[4,6567,4,6599],[4,6600,4,6632],[4,6633,4,6665],[4,6666,4,6698],[4,6303,4,6335],[4,6336,4,6368],[4,6369,4,6401],[4,6402,4,6434],[4,6435,4,6467],[4,6468,4,6500],[4,6105,4,6137],[4,6138,4,6170],[4,6171,4,6203],[4,6204,4,6236],[4,6237,4,6269],[4,6270,4,6302],[4,5907,4,5939],[4,5940,4,5972],[4,5973,4,6005],[4,6006,4,6038],[4,6039,4,6071],[4,6072,4,6104],[4,5709,4,5741],[4,5742,4,5774],[4,5775,4,5807],[4,5808,4,5840],[4,5841,4,5873],[4,5874,4,5906],[4,5511,4,5543],[4,5544,4,5576],[4,5577,4,5609],[4,5610,4,5642],[4,5643,4,5675],[4,5676,4,5708],[4,5313,4,5345],[4,5346,4,5378],[4,5379,4,5411],[4,5412,4,5444],[4,5445,4,5477],[4,5478,4,5510],[4,5115,4,5147],[4,5148,4,5180],[4,5181,4,5213],[4,5214,4,5246],[4,5247,4,5279],[4,5280,4,5312],[4,4917,4,4949],[4,4950,4,4982],[4,4983,4,5015],[4,5016,4,5048],[4,5049,4,5081],[4,5082,4,5114],[4,4719,4,4751],[4,4752,4,4784],[4,4785,4,4817],[4,4818,4,4850],[4,4851,4,4883],[4,4884,4,4916],[4,4521,4,4553],[4,4554,4,4586],[4,4587,4,4619],[4,4620,4,4652],[4,4653,4,4685],[4,4686,4,4718],[4,4323,4,4355],[4,4356,4,4388],[4,4389,4,4421],[4,4422,4,4454],[4,4455,4,4487],[4,4488,4,4520],[4,4125,4,4157],[4,4158,4,4190],[4,4191,4,4223],[4,4224,4,4256],[4,4257,4,4289],[4,4290,4,4322],[4,3927,4,3959],[4,3960,4,3992],[4,3993,4,4025],[4,4026,4,4058],[4,4059,4,4091],[4,4092,4,4124],[4,3729,4,3761],[4,3762,4,3794],[4,3795,4,3827],[4,3828,4,3860],[4,3861,4,3893],[4,3894,4,3926],[4,3531,4,3563],[4,3564,4,3596],[4,3597,4,3629],[4,3630,4,3662],[4,3663,4,3695],[4,3696,4,3728],[4,3333,4,3365],[4,3366,4,3398],[4,3399,4,3431],[4,3432,4,3464],[4,3465,4,3497],[4,3498,4,3530],[4,3135,4,3167],[4,3168,4,3200],[4,3201,4,3233],[4,3234,4,3266],[4,3267,4,3299],[4,3300,4,3332],[4,2937,4,2969],[4,2970,4,3002],[4,3003,4,3035],[4,3036,4,3068],[4,3069,4,3101],[4,3102,4,3134],[4,2739,4,2771],[4,2772,4,2804],[4,2805,4,2837],[4,2838,4,2870],[4,2871,4,2903],[4,2904,4,2936],[4,2541,4,2573],[4,2574,4,2606],[4,2607,4,2639],[4,2640,4,2672],[4,2673,4,2705],[4,2706,4,2738],[4,2343,4,2375],[4,2376,4,2408],[4,2409,4,2441],[4,2442,4,2474],[4,2475,4,2507],[4,2508,4,2540],[4,2145,4,2177],[4,2178,4,2210],[4,2211,4,2243],[4,2244,4,2276],[4,2277,4,2309],[4,2310,4,2342],[4,1947,4,1979],[4,1980,4,2012],[4,2013,4,2045],[4,2046,4,2078],[4,2079,4,2111],[4,2112,4,2144],[4,1749,4,1781],[4,1782,4,1814],[4,1815,4,1847],[4,1848,4,1880],[4,1881,4,1913],[4,1914,4,1946],[4,1551,4,1583],[4,1584,4,1616],[4,1617,4,1649],[4,1650,4,1682],[4,1683,4,1715],[4,1716,4,1748],[4,1353,4,1385],[4,1386,4,1418],[4,1419,4,1451],[4,1452,4,1484],[4,1485,4,1517],[4,1518,4,1550],[4,1155,4,1187],[4,1188,4,1220],[4,1221,4,1253],[4,1254,4,1286],[4,1287,4,1319],[4,1320,4,1352],[4,957,4,989],[4,990,4,1022],[4,1023,4,1055],[4,1056,4,1088],[4,1089,4,1121],[4,1122,4,1154],[4,759,4,791],[4,792,4,824],[4,825,4,857],[4,858,4,890],[4,891,4,923],[4,924,4,956],[4,561,4,593],[4,594,4,626],[4,627,4,659],[4,660,4,692],[4,693,4,725],[4,726,4,758],[4,363,4,395],[4,396,4,428],[4,429,4,461],[4,462,4,494],[4,495,4,527],[4,528,4,560],[4,165,4,197],[4,198,4,230],[4,231,4,263],[4,264,4,296],[4,297,4,329],[4,330,4,362],[3,16236,3,16268],[3,16269,3,16301],[3,16302,3,16334],[3,16335,3,16367],[3,16368,3,16383],[4,0,4,32],[4,33,4,65],[4,66,4,98],[4,99,4,131],[4,132,4,164],[3,16038,3,16070],[3,16071,3,16103],[3,16104,3,16136],[3,16137,3,16169],[3,16170,3,16202],[3,16203,3,16235],[3,15840,3,15872],[3,15873,3,15905],[3,15906,3,15938],[3,15939,3,15971],[3,15972,3,16004],[3,16005,3,16037],[3,15642,3,15674],[3,15675,3,15707],[3,15708,3,15740],[3,15741,3,15773],[3,15774,3,15806],[3,15807,3,15839],[3,15444,3,15476],[3,15477,3,15509],[3,15510,3,15542],[3,15543,3,15575],[3,15576,3,15608],[3,15609,3,15641],[3,15246,3,15278],[3,15279,3,15311],[3,15312,3,15344],[3,15345,3,15377],[3,15378,3,15410],[3,15411,3,15443],[3,15048,3,15080],[3,15081,3,15113],[3,15114,3,15146],[3,15147,3,15179],[3,15180,3,15212],[3,15213,3,15245],[3,14850,3,14882],[3,14883,3,14915],[3,14916,3,14948],[3,14949,3,14981],[3,14982,3,15014],[3,15015,3,15047],[3,14652,3,14684],[3,14685,3,14717],[3,14718,3,14750],[3,14751,3,14783],[3,14784,3,14816],[3,14817,3,14849],[3,14454,3,14486],[3,14487,3,14519],[3,14520,3,14552],[3,14553,3,14585],[3,14586,3,14618],[3,14619,3,14651],[3,14256,3,14288],[3,14289,3,14321],[3,14322,3,14354],[3,14355,3,14387],[3,14388,3,14420],[3,14421,3,14453],[3,14058,3,14090],[3,14091,3,14123],[3,14124,3,14156],[3,14157,3,14189],[3,14190,3,14222],[3,14223,3,14255],[3,13860,3,13892],[3,13893,3,13925],[3,13926,3,13958],[3,13959,3,13991],[3,13992,3,14024],[3,14025,3,14057],[3,13662,3,13694],[3,13695,3,13727],[3,13728,3,13760],[3,13761,3,13793],[3,13794,3,13826],[3,13827,3,13859],[3,13464,3,13496],[3,13497,3,13529],[3,13530,3,13562],[3,13563,3,13595],[3,13596,3,13628],[3,13629,3,13661],[3,13266,3,13298],[3,13299,3,13331],[3,13332,3,13364],[3,13365,3,13397],[3,13398,3,13430],[3,13431,3,13463],[3,13068,3,13100],[3,13101,3,13133],[3,13134,3,13166],[3,13167,3,13199],[3,13200,3,13232],[3,13233,3,13265],[3,12870,3,12902],[3,12903,3,12935],[3,12936,3,12968],[3,12969,3,13001],[3,13002,3,13034],[3,13035,3,13067],[3,12672,3,12704],[3,12705,3,12737],[3,12738,3,12770],[3,12771,3,12803],[3,12804,3,12836],[3,12837,3,12869],[3,12474,3,12506],[3,12507,3,12539],[3,12540,3,12572],[3,12573,3,12605],[3,12606,3,12638],[3,12639,3,12671],[3,12276,3,12308],[3,12309,3,12341],[3,12342,3,12374],[3,12375,3,12407],[3,12408,3,12440],[3,12441,3,12473],[3,12078,3,12110],[3,12111,3,12143],[3,12144,3,12176],[3,12177,3,12209],[3,12210,3,12242],[3,12243,3,12275],[3,11880,3,11912],[3,11913,3,11945],[3,11946,3,11978],[3,11979,3,12011],[3,12012,3,12044],[3,12045,3,12077],[3,11682,3,11714],[3,11715,3,11747],[3,11748,3,11780],[3,11781,3,11813],[3,11814,3,11846],[3,11847,3,11879],[3,11484,3,11516],[3,11517,3,11549],[3,11550,3,11582],[3,11583,3,11615],[3,11616,3,11648],[3,11649,3,11681],[3,11286,3,11318],[3,11319,3,11351],[3,11352,3,11384],[3,11385,3,11417],[3,11418,3,11450],[3,11451,3,11483],[3,11088,3,11120],[3,11121,3,11153],[3,11154,3,11186],[3,11187,3,11219],[3,11220,3,11252],[3,11253,3,11285],[3,10890,3,10922],[3,10923,3,10955],[3,10956,3,10988],[3,10989,3,11021],[3,11022,3,11054],[3,11055,3,11087],[3,10692,3,10724],[3,10725,3,10757],[3,10758,3,10790],[3,10791,3,10823],[3,10824,3,10856],[3,10857,3,10889],[3,10494,3,10526],[3,10527,3,10559],[3,10560,3,10592],[3,10593,3,10625],[3,10626,3,10658],[3,10659,3,10691],[3,10296,3,10328],[3,10329,3,10361],[3,10362,3,10394],[3,10395,3,10427],[3,10428,3,10460],[3,10461,3,10493],[3,10098,3,10130],[3,10131,3,10163],[3,10164,3,10196],[3,10197,3,10229],[3,10230,3,10262],[3,10263,3,10295],[3,9900,3,9932],[3,9933,3,9965],[3,9966,3,9998],[3,9999,3,10031],[3,10032,3,10064],[3,10065,3,10097],[3,9702,3,9734],[3,9735,3,9767],[3,9768,3,9800],[3,9801,3,9833],[3,9834,3,9866],[3,9867,3,9899],[3,9504,3,9536],[3,9537,3,9569],[3,9570,3,9602],[3,9603,3,9635],[3,9636,3,9668],[3,9669,3,9701],[3,9306,3,9338],[3,9339,3,9371],[3,9372,3,9404],[3,9405,3,9437],[3,9438,3,9470],[3,9471,3,9503],[3,9108,3,9140],[3,9141,3,9173],[3,9174,3,9206],[3,9207,3,9239],[3,9240,3,9272],[3,9273,3,9305],[3,8910,3,8942],[3,8943,3,8975],[3,8976,3,9008],[3,9009,3,9041],[3,9042,3,9074],[3,9075,3,9107],[3,8712,3,8744],[3,8745,3,8777],[3,8778,3,8810],[3,8811,3,8843],[3,8844,3,8876],[3,8877,3,8909],[3,8514,3,8546],[3,8547,3,8579],[3,8580,3,8612],[3,8613,3,8645],[3,8646,3,8678],[3,8679,3,8711],[3,8316,3,8348],[3,8349,3,8381],[3,8382,3,8414],[3,8415,3,8447],[3,8448,3,8480],[3,8481,3,8513],[3,8118,3,8150],[3,8151,3,8183],[3,8184,3,8216],[3,8217,3,8249],[3,8250,3,8282],[3,8283,3,8315],[3,7920,3,7952],[3,7953,3,7985],[3,7986,3,8018],[3,8019,3,8051],[3,8052,3,8084],[3,8085,3,8117],[3,7722,3,7754],[3,7755,3,7787],[3,7788,3,7820],[3,7821,3,7853],[3,7854,3,7886],[3,7887,3,7919],[3,7524,3,7556],[3,7557,3,7589],[3,7590,3,7622],[3,7623,3,7655],[3,7656,3,7688],[3,7689,3,7721],[3,7326,3,7358],[3,7359,3,7391],[3,7392,3,7424],[3,7425,3,7457],[3,7458,3,7490],[3,7491,3,7523],[3,7128,3,7160],[3,7161,3,7193],[3,7194,3,7226],[3,7227,3,7259],[3,7260,3,7292],[3,7293,3,7325],[3,6930,3,6962],[3,6963,3,6995],[3,6996,3,7028],[3,7029,3,7061],[3,7062,3,7094],[3,7095,3,7127],[3,6732,3,6764],[3,6765,3,6797],[3,6798,3,6830],[3,6831,3,6863],[3,6864,3,6896],[3,6897,3,6929],[3,6534,3,6566],[3,6567,3,6599],[3,6600,3,6632],[3,6633,3,6665],[3,6666,3,6698],[3,6699,3,6731],[3,6336,3,6368],[3,6369,3,6401],[3,6402,3,6434],[3,6435,3,6467],[3,6468,3,6500],[3,6501,3,6533],[3,6138,3,6170],[3,6171,3,6203],[3,6204,3,6236],[3,6237,3,6269],[3,6270,3,6302],[3,6303,3,6335],[3,5940,3,5972],[3,5973,3,6005],[3,6006,3,6038],[3,6039,3,6071],[3,6072,3,6104],[3,6105,3,6137],[3,5742,3,5774],[3,5775,3,5807],[3,5808,3,5840],[3,5841,3,5873],[3,5874,3,5906],[3,5907,3,5939],[3,5544,3,5576],[3,5577,3,5609],[3,5610,3,5642],[3,5643,3,5675],[3,5676,3,5708],[3,5709,3,5741],[3,5346,3,5378],[3,5379,3,5411],[3,5412,3,5444],[3,5445,3,5477],[3,5478,3,5510],[3,5511,3,5543],[3,5148,3,5180],[3,5181,3,5213],[3,5214,3,5246],[3,5247,3,5279],[3,5280,3,5312],[3,5313,3,5345],[3,4950,3,4982],[3,4983,3,5015],[3,5016,3,5048],[3,5049,3,5081],[3,5082,3,5114],[3,5115,3,5147],[3,4752,3,4784],[3,4785,3,4817],[3,4818,3,4850],[3,4851,3,4883],[3,4884,3,4916],[3,4917,3,4949],[3,4554,3,4586],[3,4587,3,4619],[3,4620,3,4652],[3,4653,3,4685],[3,4686,3,4718],[3,4719,3,4751],[3,4356,3,4388],[3,4389,3,4421],[3,4422,3,4454],[3,4455,3,4487],[3,4488,3,4520],[3,4521,3,4553],[3,4158,3,4190],[3,4191,3,4223],[3,4224,3,4256],[3,4257,3,4289],[3,4290,3,4322],[3,4323,3,4355],[3,3960,3,3992],[3,3993,3,4025],[3,4026,3,4058],[3,4059,3,4091],[3,4092,3,4124],[3,4125,3,4157],[3,3762,3,3794],[3,3795,3,3827],[3,3828,3,3860],[3,3861,3,3893],[3,3894,3,3926],[3,3927,3,3959],[3,3564,3,3596],[3,3597,3,3629],[3,3630,3,3662],[3,3663,3,3695],[3,3696,3,3728],[3,3729,3,3761],[3,3366,3,3398],[3,3399,3,3431],[3,3432,3,3464],[3,3465,3,3497],[3,3498,3,3530],[3,3531,3,3563],[3,3168,3,3200],[3,3201,3,3233],[3,3234,3,3266],[3,3267,3,3299],[3,3300,3,3332],[3,3333,3,3365],[3,2970,3,3002],[3,3003,3,3035],[3,3036,3,3068],[3,3069,3,3101],[3,3102,3,3134],[3,3135,3,3167],[3,2772,3,2804],[3,2805,3,2837],[3,2838,3,2870],[3,2871,3,2903],[3,2904,3,2936],[3,2937,3,2969],[3,2574,3,2606],[3,2607,3,2639],[3,2640,3,2672],[3,2673,3,2705],[3,2706,3,2738],[3,2739,3,2771],[3,2376,3,2408],[3,2409,3,2441],[3,2442,3,2474],[3,2475,3,2507],[3,2508,3,2540],[3,2541,3,2573],[3,2178,3,2210],[3,2211,3,2243],[3,2244,3,2276],[3,2277,3,2309],[3,2310,3,2342],[3,2343,3,2375],[3,1980,3,2012],[3,2013,3,2045],[3,2046,3,2078],[3,2079,3,2111],[3,2112,3,2144],[3,2145,3,2177],[3,1782,3,1814],[3,1815,3,1847],[3,1848,3,1880],[3,1881,3,1913],[3,1914,3,1946],[3,1947,3,1979],[3,1584,3,1616],[3,1617,3,1649],[3,1650,3,1682],[3,1683,3,1715],[3,1716,3,1748],[3,1749,3,1781],[3,1386,3,1418],[3,1419,3,1451],[3,1452,3,1484],[3,1485,3,1517],[3,1518,3,1550],[3,1551,3,1583],[3,1188,3,1220],[3,1221,3,1253],[3,1254,3,1286],[3,1287,3,1319],[3,1320,3,1352],[3,1353,3,1385],[3,990,3,1022],[3,1023,3,1055],[3,1056,3,1088],[3,1089,3,1121],[3,1122,3,1154],[3,1155,3,1187],[3,792,3,824],[3,825,3,857],[3,858,3,890],[3,891,3,923],[3,924,3,956],[3,957,3,989],[3,594,3,626],[3,627,3,659],[3,660,3,692],[3,693,3,725],[3,726,3,758],[3,759,3,791],[3,396,3,428],[3,429,3,461],[3,462,3,494],[3,495,3,527],[3,528,3,560],[3,561,3,593],[3,198,3,230],[3,231,3,263],[3,264,3,296],[3,297,3,329],[3,330,3,362],[3,363,3,395],[3,0,3,32],[3,33,3,65],[3,66,3,98],[3,99,3,131],[3,132,3,164],[3,165,3,197]]}
[]
[]
[]
[null,"Rekenblad toetsing partijkeuring grond Besluit bodemkwaliteit"]
[]
[]
[]
[]
[]
[]
[]
[]
[null,"Rekenblad"]
[null,"toetsing partijkeuring"]
[null,"Besluit en Regeling bodemkwaliteit"]
[null,"Beoordelingsrichtlijn BRL1000-protocol 1001"]
[]
[]
[]
[]
[null,"Dit rekenblad berekent,"]
[null,"nadat u de betreffende partij- en analysegegevens heeft ingevuld,"]
[null,"de kwaliteit van de uitgekeurde partij grond of baggerspecie."]
[]
[]
[]
[null,"Een belangrijke voorwaarde is dat u in het menu 'Office knop'"]
[null,"onder 'opties voor excel' in het menu 'Formules' de optie"]
[null,"'Iteratieve berekening' aanvinkt, anders krijgt u de foutmelding"]
[null,"'kruisverwijzing' en werkt het rekenblad niet op de juiste wijze."]
[]
[]
[null,null,"lichtblauwe velden zijn invulvelden"]
[]
[null,null,"lichtgroene velden bevatten wettelijk voorgeschreven waarden"]
[]
[]
[]
[null,"U kunt met invullen beginnen op het tabblad 'Bodemkwaliteit'"]